Are you the publisher? Claim or contact us about this channel


Embed this content in your HTML

Search

Report adult content:

click to rate:

Account: (login)

More Channels


Showcase


Channel Catalog


Channel Description:

Latest Forum Threads in SAP NetWeaver Technology Platform

older | 1 | .... | 70 | 71 | (Page 72) | 73 | 74 | .... | 76 | newer

    0 0

    Dear SAP Experts,

     

    I have problem with installing sap sourcing component using SUM in my Java system. Components that i want to install are ESO-OPTIMIZER and ESO-SERVER.

    In middle of Deploy Software Component step, error message appeared like below:

    I have checked the error, component ESO-OPTIMIZER was successfully installed but ESO-SERVER was aborted.

    Part of error in deploy-component_xx.log is below:

     

    * Web Model Builder: Model could not be built due to exception: java.lang.RuntimeException: java.util.zip.ZipException: Open failed for '/usr/sap/SID/J00/j2ee/cluster/server0/temp/deploy/esoserver.sda1458808803674/fcsourcing.extracted.war/WEB-INF/lib/db2jcc.jar' with fd 315 returning message 'zip file is empty' and errno 0 after trying cache. at com.sap.tc.jtools.jlinee.web.model.WebModelBuilder.processJars(WebModelBuilder.java:1998). See the trace files for details., file: fcsourcing.war, severity: error]

     

    In server the folder with path bold font '/usr/sap/SID/J00/j2ee/cluster/server0/temp/deploy/esoserver.sda1458808803674/fcsourcing.extracted.war/WEB-INF/lib/ is not exist.

     

    Please help me to investigate and solve this error.

     

    Thanks & best regards,

    Husin


    0 0

    HI Mates..!

     

    I am learner and student I downloaded SCN - SAP NetWeaver Application Server ABAP 7.02 SP6 32-bit Trial Version

    but sapint.exe (installer) is not available in downloaded pack.

     

    kindly could any body guide me to install the NetWeaver Application Server ABAP 7.02 SP6 32-bit Trial Version on my local laptop for learn by doing

     

    Regards


    0 0
  • 03/31/16--12:35: Shared Object memory problem
  • Dear Experts,

     

    I am facing an issue regarding of shared object memory problem.What is the parameters need to set for this issue can you guide me please.Now in our company Abapers and webdynpro people are facing this issue.

     

    Inline image 1


    0 0

    Hi all,

     

     

    I've just installed NW702 on SLES 12 with MaxDB 7.9.08.23

     

     

    Now I want to update the MaxDB to 7.9.08.34 with SDBSETUP via GUI (I know i can use the command line, but not for the global listener).

     

     

    When I start SDBSETUP I get some Errors:

     

     

    1) libpangox-1.0.so.0: cannot open shared object file...

    Solution:

    - ln -sf libpangoxft-1.0.so.0.3600.3 libpangox-1.0.so.0 (in /usr/lib and /usr/lib64)

     

     

    2) libpng.so.3: cannot open shared object file...

    Solution:

    - Installation of libpng12 (64bit and 32bit) with yast

    - ln -sf libpng12.so.0.50.0 libpng.so (in /usr/lib and /usr/lib64)

    - ln -sf libpng12.so.0.50.0 libpng.so.3 (in /usr/lib and /usr/lib64)

    (This problem I had in SLES11, too)

     

     

    3) libjpeg.so.62: cannot open shared object file...

    Solution:

    - Installation of libjpeg62 (64bit and 32bit) with yast

     

     

    4) libtiff.so.3: cannot open shared object file...

    Solution:

    - ln -sf libtiff.so.5.2.2 libtiff.so (in /usr/lib and /usr/lib64)

    - ln -sf libtiff.so.5.2.2 libtiff.so.3 (in /usr/lib and /usr/lib64)

     

     

    Now it is running, but with many grafical errors. For example no radio buttons will be shown.

     

     

    In the terminal where I startet it, there are errors:

     

     

    --------------------------------------------------------------

    ** (-e:4919): WARNING **: Pixbuf theme: Cannot load pixmap file /usr/share/themes/Adwaita/gtk-2.0/Check-Radio/option-checked.png: Failed to load image '/usr/share/themes/Adwaita/gtk-2.0/Check-Radio/option-checked.png': Fatal error in PNG image file: bad parameters to zlib

     

     

     

    (-e:4919): GdkPixbuf-CRITICAL **: gdk_pixbuf_get_width: assertion 'GDK_IS_PIXBUF (pixbuf)' failed

     

     

    (-e:4919): GdkPixbuf-CRITICAL **: gdk_pixbuf_get_height: assertion 'GDK_IS_PIXBUF (pixbuf)' failed

     

     

    ** (-e:4919): WARNING **: Pixbuf theme: Cannot load pixmap file /usr/share/themes/Adwaita/gtk-2.0/Check-Radio/option-unchecked.png: Failed to load image '/usr/share/themes/Adwaita/gtk-2.0/Check-Radio/option-unchecked.png': Fatal error in PNG image file: bad parameters to zlib

     

     

     

    (-e:4919): GdkPixbuf-CRITICAL **: gdk_pixbuf_get_width: assertion 'GDK_IS_PIXBUF (pixbuf)' failed

     

     

    (-e:4919): GdkPixbuf-CRITICAL **: gdk_pixbuf_get_height: assertion 'GDK_IS_PIXBUF (pixbuf)' failed

     

     

    ** (-e:4919): WARNING **: Pixbuf theme: Cannot load pixmap file /usr/share/themes/Adwaita/gtk-2.0/Buttons/button-default.png: Failed to load image '/usr/share/themes/Adwaita/gtk-2.0/Buttons/button-default.png': Fatal error in PNG image file: bad parameters to zlib

     

     

     

    (-e:4919): GdkPixbuf-CRITICAL **: gdk_pixbuf_get_width: assertion 'GDK_IS_PIXBUF (pixbuf)' failed

     

     

    (-e:4919): GdkPixbuf-CRITICAL **: gdk_pixbuf_get_height: assertion 'GDK_IS_PIXBUF (pixbuf)' failed

     

     

    ** (-e:4919): WARNING **: Invalid borders specified for theme pixmap:

            /usr/share/themes/Adwaita/gtk-2.0/Buttons/button-default.png,

    borders don't fit within the image

    --------------------------------------------------------------

     

     

    Any idea?

     

     

    I've already installed GTK2 but it doesn't help.

     

     

    Regards

    Thomas


    0 0

    Hi All,

     

    We are implementing SAP SLC 2.0, for which we have installed the SLQ QA Sell Side system in the DMZ, outside the company firewall. The server is also not joined to the domain. We now have a requirement to enable SNC on the application server. For obvious reasons we need to be able to let the application server communicate to the domain controller. IT Security has agreed to open ports in the firewall to let the application server communicate to the domain controller, the condition being that only LDAP(S), which is secure LDAP on port 636 can be opened. My question is that how we force the SAP application to connect to domain controller using LDAP(s) and not LDAP for which port will obviously not be opened. I need to be able to run the Windows service SAP<SID>_NN  with user SAPService<SID> created on the domain.

     

    Regards

    Joyee


    0 0

    Dear Experts,

     

    I am installing SAP ERP 607 Sr2 with SAP ASE on SUSE 12 64.

     

    During installation phase i m getting error when Sapinst starting the instance.

     

    Plz check below screenshot.

     

    .Error.jpg

     

    Please help.

     

    Best Regards,

    Qazi Jamil


    0 0

    Hello everyone,

     

    We are currently upgrading our servers from Win server 2003 to Win server 2012. So our content server is also affected. The installation worked fine and we can use the new server. Now I have to migrate the repositories from the old server to the new one. Is it enough when the repositories and certificates are copied?

     

    Regards

    Reinert


    0 0

    Hello community Can you help me for this problem in installation SAP NetWeaver AS ABAP 7.02 SP6 64-bit Trialversion?

     

    Error is below :

     

    An error occurred while processing option SAP NetWeaver 7.0 including Enhancement Package 2 > SAP Application Server ABAP > MaxDB > Central System > Central System( Last error reported by the step :System call failed. Error 87 (The parameter is incorrect. ) in execution of system call 'GetVolumePathName' with parameter (J:\), line (187) in file (synxcfsmnt.cpp), stack trace: iaxxejsctl.cpp: 272: EJS_ControllerImpl::executeScript() d:\depot\bas\720_rel\bc_720-1_rel\gen\optu\ntamd64\ins\sapinst\impl\src\ejs\iaxxejsbas.hpp: 450: EJS_Base::dispatchFunctionCall() iaxxejsexp.cpp: 178: EJS_Installer::invokeModuleCall() synxcfsmit.cpp: 466: CSyFSMountIteratorImpl::get() synxcfsmnt.cpp: 158: CSyFSMountImpl::CSyFSMountImpl(const CSyPath& J:/) .).

     

    Thank you


    0 0

    Hi,

    I have installed a BW NW trail Version in Amazone Web Service using Amazon cloud Service. I can establish Connection to BW System and get the Login popup in web. But the Problem is I dont know which user Name and Password to use (see also the attachment)

    Many thanks for your help

    Abolfazl


    0 0

    Dear Experts,

     

    I wan to know how to create individual IDOC(Non-aggregated) per POS transaction using WPUUMS message type, but without using WPUBON. I know there is setting in Task code 0014 (Generate WPUUMS IDOC) for number of items to be maintained as a '1' and run this task using PIPE dispatcher program by setting up POS transaction per package to '1', but it seems that I am getting warning message

     

    Task 0014: package size may affect aggregation efficiency

     

    Message No. /POSDW/TASK013

     

     

    Diagnosis

     

    You have assigned an aggregation method to task 0014. In addition, the maximum number of POS transactions (package size) is indicated.

     

     

    System Response

     

    As the system performs the aggregation separately by package, the aggregation efficiency may not be optimal. This may result in the creation of multiple documents, for example.

     

    Procedure

     

    Check whether processing without a limit on the package size is possible.

     

    Please find the screen shot of the task setting and warning message. Could you please help me resolve this issue?

     

    Regards,

    Nitin Goyal


    0 0
  • 06/10/12--06:21: Error in MAIN_SHDRUN/ACT_UPG
  • Hi,

     

    I am doing an EHP6 upgrade and I am getting an error in the MAIN_SHDRUN/ACT_UPG phase. The error directs me to the SAPup.ECO file. Please find the contents of this file below. Please assist.

     

     

     

    FSAPup> Starting subprocess at 20120607070947

        ENV: JAVA_HOME=C:\j2sdk1.4.2_17-x64

        ENV: NLS_LANG=AMERICAN_AMERICA.UTF8

        ENV: ORACLE_HOME=F:\oracle\PRD\11202

        ENV: ORACLE_SID=PRD

        ENV: PATHEXT=.COM;.EXE;.BAT;.CMD;.VBS;.VBE;.JS;.JSE;.WSF;.WSH;.MSC

        ENV: SAPDATA_HOME=F:\oracle\PRD

        ENV: SAPSYSTEMNAME=PRD

        ENV: auth_shadow_upgrade=0

        ENV: dbs_ora_schema=SAPSR3

        ENV: dbs_ora_tnsname=PRD

        ENV: PATH=C:\Windows\system32

     

    EXECUTING C:\Windows\system32\msiexec.exe (msiexec)  /qn /norestart /i E:\usr\sap\PRD\SUM\abap\exe\vcredist_x64.msi

    SAPup> Starting subprocess at 20120607070947

        ENV: JAVA_HOME=C:\j2sdk1.4.2_17-x64

        ENV: NLS_LANG=AMERICAN_AMERICA.UTF8

        ENV: ORACLE_HOME=F:\oracle\PRD\11202

        ENV: ORACLE_SID=PRD

        ENV: PATHEXT=.COM;.EXE;.BAT;.CMD;.VBS;.VBE;.JS;.JSE;.WSF;.WSH;.MSC

        ENV: SAPDATA_HOME=F:\oracle\PRD

        ENV: SAPSYSTEMNAME=PRD

        ENV: auth_shadow_upgrade=0

        ENV: dbs_ora_schema=SAPSR3

        ENV: dbs_ora_tnsname=PRD

        ENV: PATH=C:\Windows\system32

     

    EXECUTING C:\Windows\system32\msiexec.exe (msiexec)  /qn /norestart /i E:\usr\sap\PRD\SUM\abap\exenew\vcredist_x64.msi

     

    ### Phase PREP_INPUT/DBQUERY_PRE:

     

    ### Phase PREP_INPUT/TOOLVERSION_INI:

     

    ### Phase PREP_INPUT/CONFCHK_IMP:

     

    ### Phase PREP_INPUT/CHKSYSTYPE:

     

    ### Phase PREP_INPUT/HIAV_CHK_PRE:

     

    ### Phase PREP_INPUT/J2EE_CHK1:

     

    ### Phase PREP_INPUT/INSTANCELIST_PRE:

     

    ### Phase PREP_INPUT/HIAV_CHK_POST:

     

    ### Phase PREP_INPUT/CHECKSYSSTATUS_POST:

     

    ### Phase PREP_INPUT/CHECK4SOLMAN:

     

    ### Phase PREP_INIT/DBCHK_INI:

     

    ### Phase PREP_INIT/SWITCHPARAM_UPGDIR:

     

    ### Phase PREP_INIT/REQ_J2EEUPG:

     

    ### Phase PREP_INIT/SETSYNC_PREP_STARTED:

     

    ### Phase PREP_INIT/VERSCHK_INI:

     

    ### Phase PREP_INIT/VALCHK_INI:

     

    ### Phase PREP_INIT/LMSEMAPHORE_SET:

     

    ### Phase PREP_INIT/EHP_CHK:

     

    ### Phase PREP_INIT/UNICODE_CHK_PRE:

     

    ### Phase PREP_INIT/TOOLVERSION_UPG1:

     

    ### Phase PREP_INIT/DBCONNCHK_INI:

     

    ### Phase PREP_INIT/SETSYNC_INFO_FINISHED:

     

    ### Phase PREP_INIT/CLNT_CHK_INI:

     

    ### Phase PREP_INIT/PATCH_CHK1:

     

    ### Phase PREP_INIT/EXECCV:

     

    ### Phase PREP_INIT/EXECAV:

     

    ### Phase PREP_INIT/EXECEXT:

     

    ### Phase PREP_INIT/COMPINFO_INI:

     

    ### Phase PREP_INIT/JOB_RSUPDTEC:

     

    ### Phase PREP_INIT/GEN_TAIASAP:

     

    ### Phase PREP_INIT/INIT_CNTRANS_PRE:

     

    ### Phase PREP_INIT/JOB_RSDB4090:

     

    ### Phase PREP_INIT/CHK_DB6_REG_PRE:

     

    ### Phase PREP_INIT/CHK_DB6_PAR_INI:

     

    ### Phase PREP_INIT/SPACECHK_INI:

     

    ### Phase PREP_INIT/DBPREP_CHK:

     

    ### Phase PREP_INIT/ASU_CHK:

     

    ### Phase PREP_INIT/ADDON_INFO:

     

    ### Phase PREP_INIT/ADDON_SPEC1:

     

    ### Phase PREP_INIT/ADDON_TREAS:

     

    ### Phase PREP_INIT/ADDON_WFM:

     

    ### Phase PREP_INIT/ADDON_DMC:

     

    ### Phase PREP_INIT/ADDON_CMS:

     

    ### Phase PREP_INIT/ADDON_FND:

     

    ### Phase PREP_INIT/UCMIG_DECISION:

     

    ### Phase PREP_INIT/ACE_CHK:

     

    ### Phase PREP_INIT/CRM_BILL:

     

    ### Phase PREP_INIT/PR_DBPAR:

     

    ### Phase PREP_INIT/CHECKPROF_INI:

     

    ### Phase PREP_INIT/DB2_CHECKNOTES_INI:

     

    ### Phase PREP_INIT/DBCHK_INI:

     

    ### Phase PREP_INIT/SWITCHPARAM_UPGDIR:

     

    ### Phase PREP_INIT/REQ_J2EEUPG:

     

    ### Phase PREP_INIT/SETSYNC_PREP_STARTED:

     

    ### Phase PREP_INIT/VERSCHK_INI:

     

    ### Phase PREP_INIT/VALCHK_INI:

     

    ### Phase PREP_INIT/LMSEMAPHORE_SET:

     

    ### Phase PREP_INIT/EHP_CHK:

     

    ### Phase PREP_INIT/UNICODE_CHK_PRE:

     

    ### Phase PREP_INIT/TOOLVERSION_UPG1:

     

    ### Phase PREP_INIT/DBCONNCHK_INI:

     

    ### Phase PREP_INIT/SETSYNC_INFO_FINISHED:

     

    ### Phase PREP_INIT/CLNT_CHK_INI:

     

    ### Phase PREP_INIT/PATCH_CHK1:

     

    ### Phase PREP_INIT/EXECCV:

     

    ### Phase PREP_INIT/EXECAV:

     

    ### Phase PREP_INIT/EXECEXT:

     

    ### Phase PREP_INIT/COMPINFO_INI:

     

    ### Phase PREP_INIT/JOB_RSUPDTEC:

     

    ### Phase PREP_INIT/GEN_TAIASAP:

     

    ### Phase PREP_INIT/INIT_CNTRANS_PRE:

     

    ### Phase PREP_INIT/JOB_RSDB4090:

     

    ### Phase PREP_INIT/CHK_DB6_REG_PRE:

     

    ### Phase PREP_INIT/CHK_DB6_PAR_INI:

     

    ### Phase PREP_INIT/SPACECHK_INI:

     

    ### Phase PREP_INIT/DBPREP_CHK:

     

    ### Phase PREP_INIT/ASU_CHK:

     

    ### Phase PREP_INIT/ADDON_INFO:

     

    ### Phase PREP_INIT/ADDON_SPEC1:

     

    ### Phase PREP_INIT/ADDON_TREAS:

     

    ### Phase PREP_INIT/ADDON_WFM:

     

    ### Phase PREP_INIT/ADDON_DMC:

     

    ### Phase PREP_INIT/ADDON_CMS:

     

    ### Phase PREP_INIT/ADDON_FND:

     

    ### Phase PREP_INIT/UCMIG_DECISION:

     

    ### Phase PREP_INIT/ACE_CHK:

     

    ### Phase PREP_INIT/CRM_BILL:

     

    ### Phase PREP_INIT/PR_DBPAR:

     

    ### Phase PREP_INIT/CHECKPROF_INI:

     

    ### Phase PREP_INIT/DB2_CHECKNOTES_INI:

     

    ### Phase PREP_IMPORT/DMPSPC_INI:

     

    ### Phase PREP_IMPORT/READDATA:

     

    ### Phase PREP_IMPORT/READDATA_EXT:

     

    ### Phase PREP_IMPORT/PATCHCONT_RDATAEXT:

     

    ### Phase PREP_IMPORT/TOOLFIX_CHK_ALL:

     

    ### Phase PREP_IMPORT/UNICODELIB_CHK1:

    SAPup> Starting subprocess at 20120607071812

        ENV: JAVA_HOME=C:\j2sdk1.4.2_17-x64

        ENV: NLS_LANG=AMERICAN_AMERICA.UTF8

        ENV: ORACLE_HOME=F:\oracle\PRD\11202

        ENV: ORACLE_SID=PRD

        ENV: PATHEXT=.COM;.EXE;.BAT;.CMD;.VBS;.VBE;.JS;.JSE;.WSF;.WSH;.MSC

        ENV: SAPDATA_HOME=F:\oracle\PRD

        ENV: SAPSYSTEMNAME=PRD

        ENV: auth_shadow_upgrade=0

        ENV: dbs_ora_schema=SAPSR3

        ENV: dbs_ora_tnsname=PRD

     

    EXECUTING E:\usr\sap\PRD\SUM\abap\exe\tp.exe (tp.exe)  -V

    This is E:\usr\sap\PRD\SUM\abap\exe\tp.exe version 380.03.82 (release 720, unicode enabled)

     

    --------------------

    tp information

    --------------------

     

    kernel release                720

     

    kernel make variant           720_REL

     

    DBMS client library           OCI_11201_SHARE,               

     

    DBSL shared library version   720.00

     

    compiled on                   NT 5.2 3790 S x86 MS VC++ 14.00 for NTAMD64

     

    compiled for                  64 BIT

     

    compilation mode              UNICODE

     

    compile time                  May 21 2012 19:56:35

     

    update level                  0

     

    patch number                  219

     

    source id                     0.219

     

     

    ---------------------

    supported environment

    ---------------------

     

    database (SAP, table SVERS)   700

                                  710

                                  701

                                  702

                                  711

                                  720

                                  730

                                 

    DBMS server

       ORACLE 10.1.0.*.*

       ORACLE 10.2.0.*.*

       ORACLE 11.2.*.*.*

     

    operating system

    Windows NT 5.0

    Windows NT 5.1

    Windows NT 5.2

    Windows NT 6.0

    Windows NT 6.1

    Windows NT 6.2

     

     

    ---------------------------

    tp patch information

    ---------------------------

    ( 0.001) Support for SAP releases 703 and 730 with 720 kernel (note 1334542)

    ( 0.001) Tp file deployment does not work (note 1331631)

    ( 0.001) Enhanced error handling during file system deployment (note 1332638)

    ( 0.001) RC 84 during deployment step (note 1332638)

    ( 0.012) Prevent tp start via gateway for security reasons (note 1371799)

    ( 0.012) Activation of  enhancements during import (note 1053933)

    ( 0.016) Copy of generated BW objects within an upgrade (note 1382922)

    ( 0.018) Upgrade problem in phase TP_ACTION_CP2STAB (note 1388652)

    ( 0.018) Prevent tp start via gateway (compatibility change) (note 1371799)

    ( 0.019) Fix wrong size of tablsize (note 1388652)

    ( 0.021) Deleting DD objects in type T transports (note 7724)

    ( 0.031) Handling of unconfirmed transports (note 1372301)

    ( 0.031) Microsoft security patch (note 1375494)

    ( 0.032) Correct transport of LIMU DOCU TT (note 1420889)

    ( 0.034) Improved counter initialisation for RFC-GUID (note 1391335)

    ( 0.042) Avoid error in function tp_search_buffer_entry (note 1449610)

    ( 0.043) Correction concerning R3trans export (note 1457835)

    ( 0.048) DEV_TP_XXXX files in /tmp (note 1455239)

    ( 0.051) Tp terminates in function 'tp_search_buffer_entry' (note 1449610)

    ( 0.083) Langdeletions = auto (note 1558267)

    ( 0.084) Tp: TRUNCATE TABLE reports ERROR 64: no record found (note 1567984)

    ( 0.088) NTAB: Remove incompatible key length check (note 1580792)

    ( 0.090) Avoid overtaker problems with CTC=true and umode 0 (note 1333251)

    ( 0.091) Tp breaks when delivery after import fails (note 1592598)

    ( 0.100) 'tp import subset' uses client 0 instead of export client (note 1615166)

    ( 0.107) Missing import steps in import history (note 1625174)

    ( 0.107) Overtaker transports and CTC=true (note 1333251)

    ( 0.210) RSecSSFs: UTF8 conversion failed with returncode 1 (note 1678336)

    ( 0.210) Tp writelog did not work for long TR if nbufform was not s (note 1675626)

    ( 0.210) Installing/Updating SAP CTS Plug-In 2.0 (note 1665940)

    ( 0.211) Installing/Updating SAP CTS Plug-In 2.0 (note 1665940)

    ( 0.212) Installing/Updating SAP CTS Plug-In 2.0 (note 1665940)

    ( 0.215) IBM i: Problems with file locks in the transport directory (note 845879)

    ( 0.219) Tp clearold extension for cts+  and tmp directories (note 1694830)

     

    ----------------------

    dbsl patch information

    ----------------------

    ( 0.002) Core dump in dbacockpit (note 1331586)

    ( 0.002) Individual solution without a specific SAP Note. (note 1331586)

    ( 0.005) DBSL error in connection with DBACOCKPIT (note 1350947)

    ( 0.027) Check NLS_LENGTH_SEMANTICS (note 1412123)

    ( 0.031) Avoid unnecessary connect attempts (note 1413668)

    ( 0.033) Avoid senseless connect attempts (2) (note 1413668)

    ( 0.034) Secondary connection to Oracle DB (note 808505)

    ( 0.051) Core dumps, LOBPREFETCH fails (note 1331586)

    ( 0.053) ABAP: Return technical database PPMS information (note 1419552)

    ( 0.054) ABAP: Return technical database PPMS information (note 1419552)

    ( 0.054) Technical database PPMS information (note 1419552)

    ( 0.058) Low performance esp. with long SQL statements (note 1489994)

    ( 0.064) Unwanted Oracle tracing (note 1505012)

    ( 0.073) Secondary connections to Oracle, corr. of connect error (note 808505)

    ( 0.077) Invalid number of records after INSERT (note 1535262)

    ( 0.079) Secondary connections to Oracle database (correction) (note 808505)

    ( 0.081) DBSL error in secondary connection (note 1506867)

    ( 0.084) Secondary connections to Oracle database, default charset (note 808505)

    ( 0.088) ERROR: Unregister application info (note 1480392)

    ( 0.089) Missing owner in menu system -> status (note 1589777)

    ( 0.090) Wrong owner in menu system -> status (note 1589777)

    ( 0.092) Secondary connection to HANA (note 1481256)

    ( 0.096) Application info (DBSL Oracle), correction (note 1480392)

    ( 0.098) Secure connect via secure store (note 1611877)

    ( 0.098) DBSL convertion: wrong error code (note 1610265)

    ( 0.102) Wrong message from conversion check function (note 1623140)

    ( 0.106) Select error in dbsl adbc interface (note 1632627)

    ( 0.109) Core dump in DlLoadLib2() loading the DBSL (note 1635509)

    ( 0.114) DBSL correction for Oracle type mapping (note 1655337)

    ( 0.120) DBSL: Wrong statement ID (note 1671255)

    tp=>sapparam(1c): No Profile used.

    tp=>sapparam: SAPSYSTEMNAME neither in Profile nor in Commandline

     

    ### Phase PREP_IMPORT/CNV_CHK_IMP:

     

    ### Phase PREP_IMPORT/ICNVCHK_IMP:

     

    ### Phase PREP_IMPORT/SCRIPT_CHK_TOOL4:

     

    ### Phase PREP_IMPORT/TRBATCHK_IMP:

     

    ### Phase PREP_IMPORT/CLNT_CHK_IMP:

     

    ### Phase PREP_IMPORT/INTCHK_IMP:

     

    ### Phase PREP_IMPORT/SPACECHK_IMP:

     

    ### Phase PREP_IMPORT/PATCH_CHK2:

     

    ### Phase PREP_IMPORT/ALTER_TO:

     

    ### Phase PREP_IMPORT/GENBUFFER_TOOLIMP:

     

    ### Phase PREP_IMPORT/TOOLIMPD:

    SAPup> Starting subprocess at 20120607071817

        ENV: JAVA_HOME=C:\j2sdk1.4.2_17-x64

        ENV: NLS_LANG=AMERICAN_AMERICA.UTF8

        ENV: ORACLE_HOME=F:\oracle\PRD\11202

        ENV: ORACLE_SID=PRD

        ENV: PATHEXT=.COM;.EXE;.BAT;.CMD;.VBS;.VBE;.JS;.JSE;.WSF;.WSH;.MSC

        ENV: SAPDATA_HOME=F:\oracle\PRD

        ENV: SAPSYSTEMNAME=PRD

        ENV: auth_shadow_upgrade=0

        ENV: dbs_ora_schema=SAPSR3

        ENV: dbs_ora_tnsname=PRD

        ENV: PATH=E:\usr\sap\PRD\DVEBMGS30\exe

     

    EXECUTING E:\usr\sap\PRD\DVEBMGS30\exe\tp.exe (tp.exe)  pf=E:\usr\sap\PRD\SUM\abap\var\TOOLIMPD.TPP put PRD

    This is E:\usr\sap\PRD\DVEBMGS30\exe\tp.exe version 380.03.82 (release 720, unicode enabled)

    Warning: Parameter DAYLIGHT_SHUTDOWN is no longer used.

    Warning: Parameter WITH_TACOB is no longer used.

    Warning: Parameter IMPDP_BY_EVENT is no longer used.

    Warning: Parameter INTERRUPT is no longer used.

    Warning: unknown parameter DYNAMIC_PARAMETERS in parameter file (line 21).

    Warning: Parameter DAYLIGHT_SHUTDOWN is no longer used.

    Warning: Parameter WITH_TACOB is no longer used.

    Warning: Parameter IMPDP_BY_EVENT is no longer used.

    Warning: Parameter INTERRUPT is no longer used.

    Warning: unknown parameter DYNAMIC_PARAMETERS in parameter file (line 21).

    Warning: Parameter DBCONFPATH is no longer used.

    Looking for effective putsteps ... ... ready (looking for putsteps)

    This is E:\usr\sap\PRD\DVEBMGS30\exe\R3trans.exe version 6.23 (release 720 - 27.03.12 - 17:30:00).

    unicode enabled version

    E:\usr\sap\PRD\DVEBMGS30\exe\R3trans.exe finished (0000).

    R3trans=>sapparam(1c): No Profile used.

    R3trans=>sapparam: SAPSYSTEMNAME neither in Profile nor in Commandline

    tp finished with return code: 4

    meaning:

      A tool used by tp produced warnings

    tp=>sapparam(1c): No Profile used.

    tp=>sapparam: SAPSYSTEMNAME neither in Profile nor in Commandline

    SAPup> Process with PID 11796 terminated with status 4 at 20120607071837!

     

    ### Phase PREP_IMPORT/MVNTAB_TOOL:

     

    ### Phase PREP_IMPORT/TOOLIMPI:

    SAPup> Starting subprocess at 20120607071841

        ENV: JAVA_HOME=C:\j2sdk1.4.2_17-x64

        ENV: NLS_LANG=AMERICAN_AMERICA.UTF8

        ENV: ORACLE_HOME=F:\oracle\PRD\11202

        ENV: ORACLE_SID=PRD

        ENV: PATHEXT=.COM;.EXE;.BAT;.CMD;.VBS;.VBE;.JS;.JSE;.WSF;.WSH;.MSC

        ENV: SAPDATA_HOME=F:\oracle\PRD

        ENV: SAPSYSTEMNAME=PRD

        ENV: auth_shadow_upgrade=0

        ENV: dbs_ora_schema=SAPSR3

        ENV: dbs_ora_tnsname=PRD

        ENV: PATH=E:\usr\sap\PRD\DVEBMGS30\exe

     

    EXECUTING E:\usr\sap\PRD\DVEBMGS30\exe\tp.exe (tp.exe)  pf=E:\usr\sap\PRD\SUM\abap\var\TOOLIMPI.TPP put PRD

    This is E:\usr\sap\PRD\DVEBMGS30\exe\tp.exe version 380.03.82 (release 720, unicode enabled)

    Warning: Parameter DAYLIGHT_SHUTDOWN is no longer used.

    Warning: Parameter WITH_TACOB is no longer used.

    Warning: Parameter IMPDP_BY_EVENT is no longer used.

    Warning: Parameter INTERRUPT is no longer used.

    Warning: unknown parameter DYNAMIC_PARAMETERS in parameter file (line 20).

    Warning: Parameter DAYLIGHT_SHUTDOWN is no longer used.

    Warning: Parameter WITH_TACOB is no longer used.

    Warning: Parameter IMPDP_BY_EVENT is no longer used.

    Warning: Parameter INTERRUPT is no longer used.

    Warning: unknown parameter DYNAMIC_PARAMETERS in parameter file (line 20).

    Warning: Parameter DBCONFPATH is no longer used.

    Looking for effective putsteps ... ... ready (looking for putsteps)

    This is E:\usr\sap\PRD\DVEBMGS30\exe\R3trans.exe version 6.23 (release 720 - 27.03.12 - 17:30:00).

    unicode enabled version

    E:\usr\sap\PRD\DVEBMGS30\exe\R3trans.exe finished (0000).

    R3trans=>sapparam(1c): No Profile used.

    R3trans=>sapparam: SAPSYSTEMNAME neither in Profile nor in Commandline

    tp finished with return code: 0

    meaning:

      Everything OK

    tp=>sapparam(1c): No Profile used.

    tp=>sapparam: SAPSYSTEMNAME neither in Profile nor in Commandline

     

    ### Phase PREP_IMPORT/TOOLIMPM:

    SAPup> Starting subprocess at 20120607071911

        ENV: JAVA_HOME=C:\j2sdk1.4.2_17-x64

        ENV: NLS_LANG=AMERICAN_AMERICA.UTF8

        ENV: ORACLE_HOME=F:\oracle\PRD\11202

        ENV: ORACLE_SID=PRD

        ENV: PATHEXT=.COM;.EXE;.BAT;.CMD;.VBS;.VBE;.JS;.JSE;.WSF;.WSH;.MSC

        ENV: SAPDATA_HOME=F:\oracle\PRD

        ENV: SAPSYSTEMNAME=PRD

        ENV: auth_shadow_upgrade=0

        ENV: dbs_ora_schema=SAPSR3

        ENV: dbs_ora_tnsname=PRD

        ENV: PATH=E:\usr\sap\PRD\DVEBMGS30\exe

     

    EXECUTING E:\usr\sap\PRD\DVEBMGS30\exe\tp.exe (tp.exe)  pf=E:\usr\sap\PRD\SUM\abap\var\TOOLIMPM.TPP put PRD

    This is E:\usr\sap\PRD\DVEBMGS30\exe\tp.exe version 380.03.82 (release 720, unicode enabled)

    Warning: Parameter DAYLIGHT_SHUTDOWN is no longer used.

    Warning: Parameter WITH_TACOB is no longer used.

    Warning: Parameter IMPDP_BY_EVENT is no longer used.

    Warning: Parameter INTERRUPT is no longer used.

    Warning: unknown parameter DYNAMIC_PARAMETERS in parameter file (line 21).

    Warning: Parameter DAYLIGHT_SHUTDOWN is no longer used.

    Warning: Parameter WITH_TACOB is no longer used.

    Warning: Parameter IMPDP_BY_EVENT is no longer used.

    Warning: Parameter INTERRUPT is no longer used.

    Warning: unknown parameter DYNAMIC_PARAMETERS in parameter file (line 21).

    Warning: Parameter DBCONFPATH is no longer used.

    Looking for effective putsteps ... ... ready (looking for putsteps)

    tp finished with return code: 0

    meaning:

      Everything OK

    tp=>sapparam(1c): No Profile used.

    tp=>sapparam: SAPSYSTEMNAME neither in Profile nor in Commandline

     

    ### Phase PREP_IMPORT/TOOLIMP4_UCMIG:

     

    ### Phase PREP_IMPORT/NPREPCRE0:

     

    ### Phase PREP_PARSETUP/UVERS_SAVE:

     

    ### Phase PREP_PARSETUP/UVERS_PREIMP:

     

    ### Phase PREP_PARSETUP/UVERS_INIT:

     

    ### Phase PREP_PARSETUP/UVERS_CHK_IMP:

     

    ### Phase PREP_PARSETUP/BATCHCHK_IMP:

     

    ### Phase PREP_PARSETUP/SETUPGPAR_PARAMSHD:

     

    ### Phase PREP_PARSETUP/TOOLIMP_FEATURES:

     

    ### Phase PREP_PARSETUP/SETUPGPAR_PARAMEHP:

     

    ### Phase PREP_PARSETUP/SETUPGPAR_PDIFFEXP:

     

    ### Phase PREP_PARSETUP/SETUPGPAR_ITERATIVE:

     

    ### Phase PREP_PARSETUP/SETUPGPAR_STRESSMAKER:

     

    ### Phase PREP_PARSETUP/SETUPGPAR_UCMIG:

     

    ### Phase PREP_PARSETUP/SETUPGPAR_SINGLE_CUSTEXP:

     

    ### Phase PREP_PARSETUP/SETUPGPAR_VERSSHD:

     

    ### Phase PREP_PARSETUP/UCMIG_STATUS_SET0:

     

    ### Phase PREP_PARSETUP/CHECK4NOTES_TOOL:

     

    ### Phase PREP_CONFIGURATION/INITSUBST:

     

    ### Phase PREP_CONFIGURATION/ASKSWITCHES:

     

    ### Phase PREP_CONFIGURATION/DIR_SWITCH_ASK:

     

    ### Phase PREP_CONFIGURATION/EXTRACTKRN_DIAG:

     

    ### Phase PREP_CONFIGURATION/KX_CPYORG_DIAG:

     

    ### Phase PREP_CONFIGURATION/SCANDIR_KRNLDIAG:

     

    ### Phase PREP_CONFIGURATION/INSTANCELIST_INFO:

     

    ### Phase PREP_CONFIGURATION/RUN_RSTODIRM_CLEAN:

     

    ### Phase PREP_CONFIGURATION/NANOTES_PREP:

     

    ### Phase PREP_CONFIGURATION/EXECLANG:

     

    ### Phase PREP_CONFIGURATION/LANG_CHK:

     

    ### Phase PREP_CONFIGURATION/LANG_SELECT:

     

    ### Phase PREP_CONFIGURATION/RUN_RSUPGSLI:

     

    ### Phase PREP_SETUP/JOB_RSCREATE_PUTTBS:

     

    ### Phase PREP_SETUP/RUN_GENPUTTBSHD:

     

    ### Phase PREP_SETUP/RUN_RSCPINTS_INITPUTTB:

     

    ### Phase PREP_SETUP/RUN_RSPTBFIL_PREP:

     

    ### Phase PREP_SETUP/RUN_RSINCGEN_IMP:

     

    ### Phase PREP_SETUP/READPUTTB_INI:

     

    ### Phase PREP_SETUP/JOB_RDDGENRS:

     

    ### Phase PREP_SETUP/TR_BUF2HEAP_INSTIMP:

     

    ### Phase PREP_SETUP/TR_EXT2HEAP:

     

    ### Phase PREP_SETUP/SETUPGPAR_PARAMCOMP:

     

    ### Phase PREP_SETUP/JOB_RDDPURI2:

     

    ### Phase PREP_SETUP/SQLDB_CLEANINDCRE:

     

    ### Phase PREP_SETUP/LC_CHECK:

     

    ### Phase PREP_SETUP/MSSMETA:

     

    ### Phase PREP_SETUP/UPD_HOSTAGENT:

     

    ### Phase PREP_EXTENSION/JOB_RSUPGINIT:

     

    ### Phase PREP_EXTENSION/NCVERS_READ:

     

    ### Phase PREP_EXTENSION/UPLOAD_FIRST:

     

    ### Phase PREP_EXTENSION/COMPINFO_EXP:

     

    ### Phase PREP_EXTENSION/UPLOAD_REQUEST:

     

    ### Phase PREP_EXTENSION/SELSTACKXML_READ:

     

    ### Phase PREP_EXTENSION/IS_MV_CHK1:

     

    ### Phase PREP_EXTENSION/NAVERS_READ:

     

    ### Phase PREP_EXTENSION/SQLDB_AVERS_PIBASIS:

     

    ### Phase PREP_EXTENSION/UPG_TYPE:

     

    ### Phase PREP_EXTENSION/IS_INIT:

     

    ### Phase PREP_EXTENSION/IS_INST_BICONT:

     

    ### Phase PREP_EXTENSION/IS_INST_LIST:

     

    ### Phase PREP_EXTENSION/IS_INST:

     

    ### Phase PREP_EXTENSION/COMPINFO_ISINST:

     

    ### Phase PREP_EXTENSION/ADDON_TRBK:

     

    ### Phase PREP_EXTENSION/ADDON_DYN:

     

    ### Phase PREP_EXTENSION/CHECK4SOLMAN_EHP1:

     

    ### Phase PREP_EXTENSION/IS_MOVEMENT:

     

    ### Phase PREP_EXTENSION/COMPINFO_ISMV:

     

    ### Phase PREP_EXTENSION/SFW_MOVEMENT:

     

    ### Phase PREP_EXTENSION/COMPINFO_SFWMV:

     

    ### Phase PREP_EXTENSION/ADDONSPEC_OIL:

     

    ### Phase PREP_EXTENSION/ADDONSPEC_ISPSCA:

     

    ### Phase PREP_EXTENSION/RUN_RSUPGSFW:

     

    ### Phase PREP_EXTENSION/IS_TABDMP_EHP:

     

    ### Phase PREP_EXTENSION/SCANDIR_EPS:

     

    ### Phase PREP_EXTENSION/EHP_INCLUSION:

     

    ### Phase PREP_EXTENSION/JOB_MOBILE1:

     

    ### Phase PREP_EXTENSION/COMPINFO_EHP:

     

    ### Phase PREP_EXTENSION/IS_TABDMP_INC:

     

    ### Phase PREP_EXTENSION/ADDONSEPARATION:

     

    ### Phase PREP_EXTENSION/NAVERS2_HANDLE_INIT:

     

    ### Phase PREP_EXTENSION/NCVERS2_HANDLE_INIT:

     

    ### Phase PREP_EXTENSION/NAVERS2_DELSAINT_C_W:

     

    ### Phase PREP_EXTENSION/NAVERS2_DELSAINT_E_W:

     

    ### Phase PREP_EXTENSION/IS_SELECT:

     

    ### Phase PREP_EXTENSION/ADDONKEY_CHK:

     

    ### Phase PREP_EXTENSION/COMPINFO_ADDON:

     

    ### Phase PREP_EXTENSION/ADDON_QCALC:

     

    ### Phase PREP_EXTENSION/IS_MV_CHK2:

     

    ### Phase PREP_EXTENSION/TR_EXPPKG2HEAP:

     

    ### Phase PREP_EXTENSION/PATCHK_EQUI:

     

    ### Phase PREP_EXTENSION/PATCH_CHK3:

     

    ### Phase PREP_EXTENSION/BIND_PATCH:

     

    ### Phase PREP_EXTENSION/COMPINFO_SPP:

     

    ### Phase PREP_EXTENSION/ADDON_LANGINC:

     

    ### Phase PREP_EXTENSION/CHK_SELDELSAINT:

     

    ### Phase PREP_EXTENSION/TR_CMDIMPORT_FDTASKS:

     

    ### Phase PREP_EXTENSION/IS_MERGE:

     

    ### Phase PREP_EXTENSION/TR_QUEUE2HEAP:

     

    ### Phase PREP_EXTENSION/TR_BUF2HEAP_CUST:

     

    ### Phase PREP_EXTENSION/IS_TREMPTY:

     

    ### Phase PREP_EXTENSION/TR_CMDIMPORT_PREPARE:

     

    ### Phase PREP_EXTENSION/TR_CMDIMPORT_CUST:

     

    ### Phase PREP_EXTENSION/JOB_RDDIT020:

     

    ### Phase PREP_EXTENSION/IS_SYNC_20:

     

    ### Phase PREP_EXTENSION/CONFLICT_CHECK:

     

    ### Phase PREP_EXTENSION/UCMIG_REQINC:

     

    ### Phase PREP_EXTENSION/ICNVXRQ:

     

    ### Phase PREP_INTEGRATION/CHANGEDESTVERS:

     

    ### Phase PREP_INTEGRATION/ADJUSTPRP:

     

    ### Phase PREP_INTEGRATION/FRP_CHK:

     

    ### Phase PREP_INTEGRATION/EHPNOTE_CHK:

     

    ### Phase PREP_INTEGRATION/SCANDIR_KRN:

     

    ### Phase PREP_INTEGRATION/TOOLVERSION_EXE:

     

    ### Phase PREP_INTEGRATION/TOOLVERSION2_EXE:

     

    ### Phase PREP_INTEGRATION/SAPCRYPTOLIB_CHK:

     

    ### Phase PREP_INTEGRATION/SCANDIR_CRYPTO:

     

    ### Phase PREP_INTEGRATION/RUN_RSTODIRM_BIND:

     

    ### Phase PREP_INTEGRATION/TR_TODIR_MERGE_PATCH:

     

    ### Phase PREP_INTEGRATION/JOB_RDDIT021:

     

    ### Phase PREP_INTEGRATION/UVERS_UP_T:

     

    ### Phase PREP_INTEGRATION/SQLDB_RSA_UPD:

     

    ### Phase PREP_INTEGRATION/GENBUFFER_PREPUT:

     

    ### Phase PREP_INTEGRATION/INITTOOL_PHL:

     

    ### Phase PREP_INSTALL/WINSRV_DELSHD0:

     

    ### Phase PREP_INSTALL/INITSHD:

     

    ### Phase PREP_INSTALL/SHDINST_CRE:

     

    ### Phase PREP_INSTALL/SHDINST_CPY:

     

    ### Phase PREP_INSTALL/SHDINST_ADAPT:

     

    ### Phase PREP_INSTALL/SHDINST_MOD_RESS:

     

    ### Phase PREP_INSTALL/SHDINST_MOD_DOWN:

     

    ### Phase PREP_INSTALL/CHANGEPROF_SHDADAPT:

     

    ### Phase PREP_INSTALL/CHANGEPROF_SHD_SA_ENQUEUE:

     

    ### Phase PREP_INSTALL/CHANGEPROF_SHD_SRV_TRC:

     

    ### Phase PREP_INSTALL/CHANGEPROF_SHD_MPL:

     

    ### Phase PREP_INSTALL/SHDINST_REQ:

     

    ### Phase PREP_INSTALL/SAPMMC_PRE:

     

    ### Phase PREP_INSTALL/SHDINST_OS:

    SAPup> Starting subprocess at 20120607105451

        ENV: JAVA_HOME=C:\j2sdk1.4.2_17-x64

        ENV: NLS_LANG=AMERICAN_AMERICA.UTF8

        ENV: ORACLE_HOME=F:\oracle\PRD\11202

        ENV: ORACLE_SID=PRD

        ENV: PATHEXT=.COM;.EXE;.BAT;.CMD;.VBS;.VBE;.JS;.JSE;.WSF;.WSH;.MSC

        ENV: SAPDATA_HOME=F:\oracle\PRD

        ENV: SAPSYSTEMNAME=PRD

        ENV: auth_shadow_upgrade=0

        ENV: dbs_ora_schema=SAPSR3

        ENV: dbs_ora_tnsname=PRD

        ENV: PATH=E:\usr\sap\PRD\SUM\abap\exe

     

    EXECUTING E:\usr\sap\PRD\SUM\abap\exe\sapstartsrv.exe (sapstartsrv.exe)  <args>...

    Service succesfully installed.

     

    ### Phase PREP_INSTALL/SHDINST_SDB_CHK:

     

    ### Phase PREP_INSTALL/SHDUNINST_DB_PREP:

     

    ### Phase PREP_INSTALL/SHDINST_DB_PREP:

     

    ### Phase PREP_INSTALL/SHDINST_SWT_HOST:

     

    ### Phase PREP_INSTALL/SHDINST_PFPAR:

     

    ### Phase PREP_INSTALL/RUN_RSUPGRFC:

     

    ### Phase PREP_INSTALL/SCANDIR_SHOW:

     

    ### Phase PREP_INSTALL/RUN_UPDPUTTBSHD_SHD2:

     

    ### Phase PREP_INSTALL/RUN_RSPTBFIL_SPACE:

     

    ### Phase PREP_INSTALL/READPUTTB_SPACE:

     

    ### Phase PREP_INSTALL/RUN_RSDBSCPY_INIT:

     

    ### Phase PREP_SPACECALC/INIT_CNTRANS_NEW:

     

    ### Phase PREP_SPACECALC/CNTRANS_NEW:

     

    ### Phase PREP_SPACECALC/MULTSPC_UC:

     

    ### Phase PREP_SPACECALC/TR_GET_SPCREQ_IMP:

     

    ### Phase PREP_SPACECALC/TR_GET_SPCREQ_ADD:

     

    ### Phase PREP_SPACECALC/TR_GET_SPCREQ_DISC:

     

    ### Phase PREP_SPACECALC/TR_COLLTABS_PRP:

     

    ### Phase PREP_SPACECALC/TABSPC_PREP:

     

    ### Phase PREP_SPACECALC/RUN_GENOBJNUM:

     

    ### Phase PREP_SPACECALC/LIST_LOAD_SPC:

     

    ### Phase PREP_SPACECALC/DYNSPCADD:

     

    ### Phase PREP_SPACECALC/EU_IMPSPC:

     

    ### Phase PREP_SPACECALC/GET_CLONE_SIZE:

     

    ### Phase PREP_SPACECALC/SPCJ2EEMERGE:

     

    ### Phase PREP_SPACECALC/ADDFSREQ_FS:

     

    ### Phase PREP_SPACECALC/ADDSPAREQ_UPG:

     

    ### Phase PREP_SPACECALC/ADDSPAREQ_EHPI:

     

    ### Phase PREP_SPACECALC/ADDSPAREQ_TRANS:

     

    ### Phase PREP_GENCHECKS/CONFCHK:

     

    ### Phase PREP_GENCHECKS/JOB_SUSINUPG:

     

    ### Phase PREP_GENCHECKS/DB_ACTION_RUN_PRE:

     

    ### Phase PREP_GENCHECKS/CHK_DB6_DEF_TAB:

     

    ### Phase PREP_GENCHECKS/CHK_DB6_PAR_PRE:

     

    ### Phase PREP_GENCHECKS/CHK_DB6_GLOBAL_FILES:

     

    ### Phase PREP_GENCHECKS/CHK_DB6_4K_TBSP_PRE:

     

    ### Phase PREP_GENCHECKS/UNICODELIB_CHK2:

    SAPup> Starting subprocess at 20120607121819

        ENV: JAVA_HOME=C:\j2sdk1.4.2_17-x64

        ENV: NLS_LANG=AMERICAN_AMERICA.UTF8

        ENV: ORACLE_HOME=F:\oracle\PRD\11202

        ENV: ORACLE_SID=PRD

        ENV: PATHEXT=.COM;.EXE;.BAT;.CMD;.VBS;.VBE;.JS;.JSE;.WSF;.WSH;.MSC

        ENV: SAPDATA_HOME=F:\oracle\PRD

        ENV: SAPSYSTEMNAME=PRD

        ENV: auth_shadow_upgrade=0

        ENV: dbs_ora_schema=SAPSR3

        ENV: dbs_ora_tnsname=PRD

     

    EXECUTING E:\usr\sap\PRD\SUM\abap\exe\tp.exe (tp.exe)  -V

    This is E:\usr\sap\PRD\SUM\abap\exe\tp.exe version 380.03.82 (release 720, unicode enabled)

     

    --------------------

    tp information

    --------------------

     

    kernel release                720

     

    kernel make variant           720_REL

     

    DBMS client library           OCI_11201_SHARE,               

     

    DBSL shared library version   720.00

     

    compiled on                   NT 5.2 3790 S x86 MS VC++ 14.00 for NTAMD64

     

    compiled for                  64 BIT

     

    compilation mode              UNICODE

     

    compile time                  May 21 2012 19:56:35

     

    update level                  0

     

    patch number                  219

     

    source id                     0.219

     

     

    ---------------------

    supported environment

    ---------------------

     

    database (SAP, table SVERS)   700

                                  710

                                  701

                                  702

                                  711

                                  720

                                  730

                                 

    DBMS server

       ORACLE 10.1.0.*.*

       ORACLE 10.2.0.*.*

       ORACLE 11.2.*.*.*

     

    operating system

    Windows NT 5.0

    Windows NT 5.1

    Windows NT 5.2

    Windows NT 6.0

    Windows NT 6.1

    Windows NT 6.2

     

     

    ---------------------------

    tp patch information

    ---------------------------

    ( 0.001) Support for SAP releases 703 and 730 with 720 kernel (note 1334542)

    ( 0.001) Tp file deployment does not work (note 1331631)

    ( 0.001) Enhanced error handling during file system deployment (note 1332638)

    ( 0.001) RC 84 during deployment step (note 1332638)

    ( 0.012) Prevent tp start via gateway for security reasons (note 1371799)

    ( 0.012) Activation of  enhancements during import (note 1053933)

    ( 0.016) Copy of generated BW objects within an upgrade (note 1382922)

    ( 0.018) Upgrade problem in phase TP_ACTION_CP2STAB (note 1388652)

    ( 0.018) Prevent tp start via gateway (compatibility change) (note 1371799)

    ( 0.019) Fix wrong size of tablsize (note 1388652)

    ( 0.021) Deleting DD objects in type T transports (note 7724)

    ( 0.031) Handling of unconfirmed transports (note 1372301)

    ( 0.031) Microsoft security patch (note 1375494)

    ( 0.032) Correct transport of LIMU DOCU TT (note 1420889)

    ( 0.034) Improved counter initialisation for RFC-GUID (note 1391335)

    ( 0.042) Avoid error in function tp_search_buffer_entry (note 1449610)

    ( 0.043) Correction concerning R3trans export (note 1457835)

    ( 0.048) DEV_TP_XXXX files in /tmp (note 1455239)

    ( 0.051) Tp terminates in function 'tp_search_buffer_entry' (note 1449610)

    ( 0.083) Langdeletions = auto (note 1558267)

    ( 0.084) Tp: TRUNCATE TABLE reports ERROR 64: no record found (note 1567984)

    ( 0.088) NTAB: Remove incompatible key length check (note 1580792)

    ( 0.090) Avoid overtaker problems with CTC=true and umode 0 (note 1333251)

    ( 0.091) Tp breaks when delivery after import fails (note 1592598)

    ( 0.100) 'tp import subset' uses client 0 instead of export client (note 1615166)

    ( 0.107) Missing import steps in import history (note 1625174)

    ( 0.107) Overtaker transports and CTC=true (note 1333251)

    ( 0.210) RSecSSFs: UTF8 conversion failed with returncode 1 (note 1678336)

    ( 0.210) Tp writelog did not work for long TR if nbufform was not s (note 1675626)

    ( 0.210) Installing/Updating SAP CTS Plug-In 2.0 (note 1665940)

    ( 0.211) Installing/Updating SAP CTS Plug-In 2.0 (note 1665940)

    ( 0.212) Installing/Updating SAP CTS Plug-In 2.0 (note 1665940)

    ( 0.215) IBM i: Problems with file locks in the transport directory (note 845879)

    ( 0.219) Tp clearold extension for cts+  and tmp directories (note 1694830)

     

    ----------------------

    dbsl patch information

    ----------------------

    ( 0.002) Core dump in dbacockpit (note 1331586)

    ( 0.002) Individual solution without a specific SAP Note. (note 1331586)

    ( 0.005) DBSL error in connection with DBACOCKPIT (note 1350947)

    ( 0.027) Check NLS_LENGTH_SEMANTICS (note 1412123)

    ( 0.031) Avoid unnecessary connect attempts (note 1413668)

    ( 0.033) Avoid senseless connect attempts (2) (note 1413668)

    ( 0.034) Secondary connection to Oracle DB (note 808505)

    ( 0.051) Core dumps, LOBPREFETCH fails (note 1331586)

    ( 0.053) ABAP: Return technical database PPMS information (note 1419552)

    ( 0.054) ABAP: Return technical database PPMS information (note 1419552)

    ( 0.054) Technical database PPMS information (note 1419552)

    ( 0.058) Low performance esp. with long SQL statements (note 1489994)

    ( 0.064) Unwanted Oracle tracing (note 1505012)

    ( 0.073) Secondary connections to Oracle, corr. of connect error (note 808505)

    ( 0.077) Invalid number of records after INSERT (note 1535262)

    ( 0.079) Secondary connections to Oracle database (correction) (note 808505)

    ( 0.081) DBSL error in secondary connection (note 1506867)

    ( 0.084) Secondary connections to Oracle database, default charset (note 808505)

    ( 0.088) ERROR: Unregister application info (note 1480392)

    ( 0.089) Missing owner in menu system -> status (note 1589777)

    ( 0.090) Wrong owner in menu system -> status (note 1589777)

    ( 0.092) Secondary connection to HANA (note 1481256)

    ( 0.096) Application info (DBSL Oracle), correction (note 1480392)

    ( 0.098) Secure connect via secure store (note 1611877)

    ( 0.098) DBSL convertion: wrong error code (note 1610265)

    ( 0.102) Wrong message from conversion check function (note 1623140)

    ( 0.106) Select error in dbsl adbc interface (note 1632627)

    ( 0.109) Core dump in DlLoadLib2() loading the DBSL (note 1635509)

    ( 0.114) DBSL correction for Oracle type mapping (note 1655337)

    ( 0.120) DBSL: Wrong statement ID (note 1671255)

    tp=>sapparam(1c): No Profile used.

    tp=>sapparam: SAPSYSTEMNAME neither in Profile nor in Commandline

     

    ### Phase PREP_GENCHECKS/CHECK4NOTES_PACKAGES:

     

    ### Phase PREP_GENCHECKS/CHECK4HOTFIX:

     

    ### Phase PREP_GENCHECKS/DB_ACTION_PRE:

     

    ### Phase PREP_GENCHECKS/DB_ACTION_EXTMAN:

     

    ### Phase PREP_GENCHECKS/MSSQL_SCHEMA_PRE:

     

    ### Phase PREP_GENCHECKS/CNV_CHK_GEN:

     

    ### Phase PREP_GENCHECKS/CHK_ICNVFLAGS:

     

    ### Phase PREP_GENCHECKS/TRBATCHK_GEN:

     

    ### Phase PREP_GENCHECKS/CLNT_CHK_GEN:

     

    ### Phase PREP_GENCHECKS/SCRIPT_TST_DDART:

     

    ### Phase PREP_GENCHECKS/NTACT_CHK:

     

    ### Phase PREP_GENCHECKS/INTCHK_GEN:

     

    ### Phase PREP_GENCHECKS/SINXCHK:

     

    ### Phase PREP_GENCHECKS/VIEWCHK_PRP:

     

    ### Phase PREP_GENCHECKS/ENVCHK_PRE:

     

    ### Phase PREP_GENCHECKS/FRONTREQ_PRE:

     

    ### Phase PREP_GENCHECKS/UVERS_CHK_GEN:

     

    ### Phase PREP_GENCHECKS/BATCHCHK_GEN:

     

    ### Phase PREP_GENCHECKS/SCRIPT_TST_TCPDB:

     

    ### Phase PREP_GENCHECKS/SCRIPT_TST_TCP0C:

     

    ### Phase PREP_GENCHECKS/SCRIPT_TST_TCPDB_UC:

     

    ### Phase PREP_GENCHECKS/MERGEPROF_CHECK:

     

    ### Phase PREP_GENCHECKS/CHECKLANGCP_PREP:

     

    ### Phase PREP_GENCHECKS/ACTREF_CHK:

     

    ### Phase PREP_SPACECHECKS/FREECHK:

     

    ### Phase PREP_SPACECHECKS/SPACECHK_OPT:

     

    ### Phase PREP_MODSUPPORT/REPACHK:

     

    ### Phase PREP_MODSUPPORT/TR_CONVHEAP_IT006:

     

    ### Phase PREP_MODSUPPORT/RUN_RDDIT006_PRE:

     

    ### Phase PREP_MODSUPPORT/ADJUSTCHK_PRE_UPG:

     

    ### Phase PREP_MODSUPPORT/ADJUSTCHK_PRE_EHPI:

     

    ### Phase PREP_SPACECHECKS/FREECHK:

     

    ### Phase PREP_SPACECHECKS/SPACECHK_OPT:

     

    ### Phase PREP_SPACECHECKS/FREECHK:

     

    ### Phase PREP_SPACECHECKS/SPACECHK_OPT:

     

    ### Phase MAIN_INIT/BEGIN:

     

    ### Phase MAIN_INIT/INITPUT:

     

    ### Phase MAIN_INIT/DBCHK:

     

    ### Phase MAIN_INIT/J2EE_CHK2:

     

    ### Phase MAIN_INIT/SETSYNC_UPGR_STARTED:

     

    ### Phase MAIN_INIT/SETSYNC_PREUP_STARTED:

     

    ### Phase MAIN_INIT/VERSCHK:

     

    ### Phase MAIN_INIT/UVERS_CHK:

     

    ### Phase MAIN_INIT/BATCHCHK:

     

    ### Phase MAIN_INIT/PATCH_CHK:

     

    ### Phase MAIN_INIT/CLNT_CHK:

     

    ### Phase MAIN_INIT/INTCHK:

     

    ### Phase MAIN_INIT/TOOLVERSION_UPG:

     

    ### Phase MAIN_INIT/ADDON_SPEC2:

     

    ### Phase MAIN_INIT/SHDINST_CHK1:

     

    ### Phase MAIN_INIT/SAPMMC_UPG:

     

    ### Phase MAIN_INIT/CONFCHK_X:

     

    ### Phase MAIN_INIT/VIEWCHK_D:

     

    ### Phase MAIN_INIT/VIEWCHK_R:

     

    ### Phase MAIN_INIT/REPACHK1:

     

    ### Phase MAIN_INIT/UCMIG_STATUS_CHK:

     

    ### Phase MAIN_INIT/SQLDB_ICNVSETMINROWS:

     

    ### Phase MAIN_INIT/TABSPC_UPG:

     

    ### Phase MAIN_INIT/CHK_DB6_REG_UPG:

     

    ### Phase MAIN_INIT/DB_ACTION_RUNSTATS:

     

    ### Phase MAIN_INIT/CHK_DB6_PAR_UPG:

     

    ### Phase MAIN_INIT/CHK_DB6_4K_TBSP_UPG:

     

    ### Phase MAIN_INIT/SPACECHK_ALL:

     

    ### Phase MAIN_INIT/FREECHK_X:

     

    ### Phase MAIN_INIT/DMPSPC_X:

     

    ### Phase MAIN_INIT/JOB_BTCTRNS0:

     

    ### Phase MAIN_INIT/RUN_RSPTBFIL_INIT:

     

    ### Phase MAIN_INIT/RUN_RCRR_TFW_INI:

     

    ### Phase MAIN_INIT/RUN_RSPTBFIL_INIT2:

     

    ### Phase MAIN_INIT/READPUTTB_UPG:

     

    ### Phase MAIN_INIT/SQLDB_SWITCH_DOCU:

     

    ### Phase MAIN_INIT/LOCKEU_PRE:

     

    ### Phase MAIN_INIT/LMSEMAPHORE_REMPRE:

     

    ### Phase MAIN_INIT/REPACHK_CLONE:

     

    ### Phase MAIN_INIT/UVERS_UP_U:

     

    ### Phase MAIN_INIT/ADJUSTCHK_TRANS:

     

    ### Phase MAIN_INIT/LIST_LOAD:

     

    ### Phase MAIN_INIT/CHECKCDMOUNTS:

     

    ### Phase MAIN_INIT/SETSYNC_PREUP_FINI_EUIMP:

     

    ### Phase MAIN_INIT/GETSYNC_PREUP_FINI_EUIMP:

     

    ### Phase MAIN_INIT/CONFCHK_BAS:

     

    ### Phase MAIN_INIT/DB_ACTION_UPG:

     

    ### Phase MAIN_INIT/CNTRANS_TPL:

     

    ### Phase MAIN_INIT/JOB_MC01_CACL_CDP_POST1:

     

    ### Phase MAIN_INIT/JOB_GN_BEF_UPG_CRM40_1:

     

    ### Phase MAIN_INIT/INSTTEMPLIC_MSGKEY:

     

    ### Phase MAIN_SHDCRE/SETSYNC_DOWN_START_EUIMP:

     

    ### Phase MAIN_SHDCRE/SETSYNC_EULCK_START_EUIMP:

     

    ### Phase MAIN_SHDCRE/SUBMOD_SHDDBCLONE/ADJUSTCHK_EHPI:

     

    ### Phase MAIN_SHDCRE/SUBMOD_SHDDBCLONE/EXTDBCLONE:

     

    ### Phase MAIN_SHDCRE/SUBMOD_SHDDBCLONE/DBCLONE_NODATA:

     

    ### Phase MAIN_SHDCRE/SUBMOD_SHDDBCLONE/DBCLONE_DATA:

     

    ### Phase MAIN_SHDCRE/SUBMOD_SHDDBCLONE/DBCLONE:

     

    ### Phase MAIN_SHDCRE/SUBMOD_SHDDBCLONE/DBCLONE:

     

    ### Phase MAIN_SHDCRE/SUBMOD_SHDDBCLONE/DBCLONE:

     

    ### Phase MAIN_SHDCRE/SUBMOD_SHDDBCLONE/READPUTTB_SHDCLONE:

     

    ### Phase MAIN_SHDCRE/SUBMOD_SHDDBCLONE/UPDATE_DBSTATS_SHDCLONE:

     

    ### Phase MAIN_SHDCRE/EU_IMPORT1:

     

    ### Phase MAIN_SHDCRE/SQLDB_DDNTT_UUID:

     

    ### Phase MAIN_SHDCRE/NTACT_NODBPOS:

     

    ### Phase MAIN_SHDCRE/SHADOW_NTACT_CP:

     

    ### Phase MAIN_SHDCRE/EU_IMPORT2:

     

    ### Phase MAIN_SHDCRE/INDQUE_CHK:

     

    ### Phase MAIN_SHDCRE/SHADOW_IMPORT_UPG1:

    SAPup> Starting subprocess at 20120608011824

        ENV: JAVA_HOME=C:\j2sdk1.4.2_17-x64

        ENV: NLS_LANG=AMERICAN_AMERICA.UTF8

        ENV: ORACLE_HOME=F:\oracle\PRD\11202

        ENV: ORACLE_SID=PRD

        ENV: PATHEXT=.COM;.EXE;.BAT;.CMD;.VBS;.VBE;.JS;.JSE;.WSF;.WSH;.MSC

        ENV: SAPDATA_HOME=F:\oracle\PRD

        ENV: SAPSYSTEMNAME=PRD

        ENV: auth_shadow_upgrade=0

        ENV: dbs_ora_schema=SAPSR3

        ENV: dbs_ora_tnsname=PRD

        ENV: PATH=E:\usr\sap\PRD\SUM\abap\exenew

     

    EXECUTING E:\usr\sap\PRD\SUM\abap\exenew\tp.exe (tp.exe)  pf=E:\usr\sap\PRD\SUM\abap\var\SHDUPGIMP1.TPP put PRD

    This is E:\usr\sap\PRD\SUM\abap\exenew\tp.exe version 380.03.82 (release 720, unicode enabled)

    Warning: Parameter DAYLIGHT_SHUTDOWN is no longer used.

    Warning: Parameter WITH_TACOB is no longer used.

    Warning: Parameter IMPDP_BY_EVENT is no longer used.

    Warning: Parameter INTERRUPT is no longer used.

    Warning: unknown parameter DYNAMIC_PARAMETERS in parameter file (line 24).

    Warning: Parameter DAYLIGHT_SHUTDOWN is no longer used.

    Warning: Parameter WITH_TACOB is no longer used.

    Warning: Parameter IMPDP_BY_EVENT is no longer used.

    Warning: Parameter INTERRUPT is no longer used.

    Warning: unknown parameter DYNAMIC_PARAMETERS in parameter file (line 24).

    Warning: Parameter DBCONFPATH is no longer used.

     

    The shadow import of ALL into PRD was not performed.

     

    PRD buffer:

     

     

    that makes 0 transports to be imported.

     

    Please check the tp command. The buffer is printed out above.

     

    tp returncode summary:

     

    TOOLS: Highest return code of single steps was: 0

    SWARNS: Highest tp internal severe warning was: 0152

    tp finished with return code: 152

    meaning:

      Nothing done.

    tp=>sapparam(1c): No Profile used.

    tp=>sapparam: SAPSYSTEMNAME neither in Profile nor in Commandline

    SAPup> Process with PID 23304 terminated with status 152 at 20120608011834!

     

    ### Phase MAIN_SHDCRE/STARTSAP_IMP:

     

    ### Phase MAIN_SHDCRE/SETUPGPAR_PARAMEU1:

     

    ### Phase MAIN_SHDCRE/REPACHK2:

     

    ### Phase MAIN_SHDCRE/RUN_MPL_FSI_TSCHEMAB:

     

    ### Phase MAIN_SHDCRE/LMSEMAPHORE_REM:

     

    ### Phase MAIN_SHDCRE/SETSYNC_EULCK_START_D1:

     

    ### Phase MAIN_SHDCRE/SETSYNC_EULCK_START_SHDSYS:

     

    ### Phase MAIN_SHDCRE/UVERS_UP_U:

     

    ### Phase MAIN_SHDCRE/CNV_CHK_XT:

     

    ### Phase MAIN_SHDCRE/TRBATCHK_XT:

     

    ### Phase MAIN_SHDCRE/LIST_LOAD:

     

    ### Phase MAIN_SHDCRE/JOB_RDDTAXIT:

     

    ### Phase MAIN_SHDCRE/SUBSTNT_INS:

     

    ### Phase MAIN_SHDCRE/RUN_RSINCGEN:

     

    ### Phase MAIN_SHDCRE/JOB_RDDINDPR:

     

    ### Phase MAIN_SHDCRE/JOB_RSEXP_E071STR_TAB:

     

    ### Phase MAIN_SHDINST/ALTEXT_MAXALL:

     

    ### Phase MAIN_SHDINST/SQLSCREXE_MLI:

     

    ### Phase MAIN_SHDINST/SQLDB_CPUSR:

     

    ### Phase MAIN_SHDINST/SUBMOD_SHDALIASCRE/PSCRGEN_ALIAS:

     

    ### Phase MAIN_SHDINST/SUBMOD_SHDALIASCRE/SCRGEN_ALI_ORG:

     

    ### Phase MAIN_SHDINST/SUBMOD_SHDALIASCRE/DB_ACTION_GRANT:

     

    ### Phase MAIN_SHDINST/SUBMOD_SHDALIASCRE/SQLSCREXE_GRANT:

     

    ### Phase MAIN_SHDINST/SUBMOD_SHDALIASCRE/SCEXEC_GRANT:

     

    ### Phase MAIN_SHDINST/SUBMOD_SHDALIASCRE/SCEXEC_ALIAS:

     

    ### Phase MAIN_SHDINST/SUBMOD_SHDALIASCRE/SQLSCREXE_GRA_ORG:

     

    ### Phase MAIN_SHDINST/SUBMOD_SHDALIASCRE/SQLSCREXE_ALI_ORG:

     

    ### Phase MAIN_SHDINST/SQLDB_CRSHDSEQ:

     

    ### Phase MAIN_SHDINST/INSTTEMPLIC_SHD:

     

    ### Phase MAIN_SHDINST/VIEWIMP_BAS:

     

    ### Phase MAIN_SHDINST/DBCONSHD:

     

    ### Phase MAIN_SHDINST/RUN_RSVWSCPY:

     

    ### Phase MAIN_SHDINST/TR_TRK2HEAP_INIT:

     

    ### Phase MAIN_SHDINST/TP_ACTION_CP2SINI:

     

    ### Phase MAIN_SHDINST/SHADOW_NTACT_DEL:

     

    ### Phase MAIN_SHDINST/EXEC_SMOFF_SHD:

     

    ### Phase MAIN_SHDINST/JOB_GN_BEF_UPG_CRM40_2:

     

    ### Phase MAIN_SHDINST/JOB_MC01_CACL_CDP_POST2:

     

    ### Phase MAIN_SHDINST/SETSYNC_PREUP_FINI_SHDSYS:

     

    ### Phase MAIN_SHDINST/GETSYNC_PREUP_FINI_SHDSYS:

     

    ### Phase MAIN_SHADOW/STARTSAP_SHDSYS:

     

    ### Phase MAIN_SHADOW/JOB_BTCTRNS2:

     

    ### Phase MAIN_SHADOW/INTCHK_SW:

     

    ### Phase MAIN_SHADOW/STOPSAP_4SHDSYS:

     

    ### Phase MAIN_SHADOW/SETSYNC_DOWN_START_SHDSYS:

     

    ### Phase MAIN_SHADOW/SHD_FIX_IMP:

     

    ### Phase MAIN_SHADOW/SQLDB_INST001:

     

    ### Phase MAIN_SHADOW/INSTANCELIST_SHD:

     

    ### Phase MAIN_SHADOW/SHDINST_CHK2:

     

    ### Phase MAIN_SHADOW/SQLDB_D1GENIN_SHD1:

     

    ### Phase MAIN_SHADOW/START_SHDI_FIRST:

    SAPup> Starting subprocess at 20120608012104

        ENV: JAVA_HOME=C:\j2sdk1.4.2_17-x64

        ENV: NLS_LANG=AMERICAN_AMERICA.UTF8

        ENV: ORACLE_HOME=F:\oracle\PRD\11202

        ENV: ORACLE_SID=PRD

        ENV: PATHEXT=.COM;.EXE;.BAT;.CMD;.VBS;.VBE;.JS;.JSE;.WSF;.WSH;.MSC

        ENV: SAPDATA_HOME=F:\oracle\PRD

        ENV: SAPSYSTEMNAME=PRD

        ENV: auth_shadow_upgrade=1

        ENV: dbs_ora_schema=SAPSR3

        ENV: dbs_ora_tnsname=PRD

        ENV: PATH=E:\usr\sap\PRD\SUM\abap\exe

     

    EXECUTING E:\usr\sap\PRD\SUM\abap\exe\sapcontrol.exe (sapcontrol.exe)  -prot PIPE -host ERPPRD -nr 31 -function StartWait 300 10

     

    08.06.2012 01:21:04

    Start

    OK

     

    08.06.2012 01:21:36

    StartWait

    OK

     

    ### Phase MAIN_SHDRUN/SETSYNC_SHD_STARTED:

     

    ### Phase MAIN_SHDRUN/NANOTES_SHD:

     

    ### Phase MAIN_SHDRUN/RUN_RSUPGRFC2:

     

    ### Phase MAIN_SHDRUN/CREATERFCDEST_S2O:

     

    ### Phase MAIN_SHDRUN/JOB_MSSSPEXE_SHD:

     

    ### Phase MAIN_SHDRUN/JOB_RSUPGCUA_SHD:

     

    ### Phase MAIN_SHDRUN/ALTNTAB_FILL:

     

    ### Phase MAIN_SHDRUN/RUNASYN_RSGENLOAD:

     

    ### Phase MAIN_SHDRUN/TABUIMP_CNV:

     

    ### Phase MAIN_SHDRUN/DDIC_UPG:

    SAPup> Starting subprocess at 20120608013011

        ENV: JAVA_HOME=C:\j2sdk1.4.2_17-x64

        ENV: NLS_LANG=AMERICAN_AMERICA.UTF8

        ENV: ORACLE_HOME=F:\oracle\PRD\11202

        ENV: ORACLE_SID=PRD

        ENV: PATHEXT=.COM;.EXE;.BAT;.CMD;.VBS;.VBE;.JS;.JSE;.WSF;.WSH;.MSC

        ENV: SAPDATA_HOME=F:\oracle\PRD

        ENV: SAPSYSTEMNAME=PRD

        ENV: auth_shadow_upgrade=1

        ENV: dbs_ora_schema=SAPSR3

        ENV: dbs_ora_tnsname=PRD

        ENV: PATH=E:\usr\sap\PRD\SUM\abap\exe

     

    EXECUTING E:\usr\sap\PRD\SUM\abap\exe\tp.exe (tp.exe)  pf=E:\usr\sap\PRD\SUM\abap\var\DDICUPG.TPP put PRD

    This is E:\usr\sap\PRD\SUM\abap\exe\tp.exe version 380.03.82 (release 720, unicode enabled)

    Warning: Parameter DAYLIGHT_SHUTDOWN is no longer used.

    Warning: Parameter WITH_TACOB is no longer used.

    Warning: Parameter IMPDP_BY_EVENT is no longer used.

    Warning: Parameter INTERRUPT is no longer used.

    Warning: unknown parameter DYNAMIC_PARAMETERS in parameter file (line 22).

    Warning: Parameter DAYLIGHT_SHUTDOWN is no longer used.

    Warning: Parameter WITH_TACOB is no longer used.

    Warning: Parameter IMPDP_BY_EVENT is no longer used.

    Warning: Parameter INTERRUPT is no longer used.

    Warning: unknown parameter DYNAMIC_PARAMETERS in parameter file (line 22).

    Warning: Parameter DBCONFPATH is no longer used.

    Looking for effective putsteps ... ... ready (looking for putsteps)

    This is E:\usr\sap\PRD\SUM\abap\exe\R3trans.exe version 6.23 (release 720 - 27.03.12 - 17:30:00).

    unicode enabled version

    E:\usr\sap\PRD\SUM\abap\exe\R3trans.exe finished (0004).

    R3trans=>sapparam(1c): No Profile used.

    R3trans=>sapparam: SAPSYSTEMNAME neither in Profile nor in Commandline

    This is E:\usr\sap\PRD\SUM\abap\exe\R3trans.exe version 6.23 (release 720 - 27.03.12 - 17:30:00).

    unicode enabled version

    E:\usr\sap\PRD\SUM\abap\exe\R3trans.exe finished (0004).

    R3trans=>sapparam(1c): No Profile used.

    R3trans=>sapparam: SAPSYSTEMNAME neither in Profile nor in Commandline

    This is E:\usr\sap\PRD\SUM\abap\exe\R3trans.exe version 6.23 (release 720 - 27.03.12 - 17:30:00).

    unicode enabled version

    E:\usr\sap\PRD\SUM\abap\exe\R3trans.exe finished (0004).

    R3trans=>sapparam(1c): No Profile used.

    R3trans=>sapparam: SAPSYSTEMNAME neither in Profile nor in Commandline

    This is E:\usr\sap\PRD\SUM\abap\exe\R3trans.exe version 6.23 (release 720 - 27.03.12 - 17:30:00).

    unicode enabled version

    E:\usr\sap\PRD\SUM\abap\exe\R3trans.exe finished (0004).

    R3trans=>sapparam(1c): No Profile used.

    R3trans=>sapparam: SAPSYSTEMNAME neither in Profile nor in Commandline

    This is E:\usr\sap\PRD\SUM\abap\exe\R3trans.exe version 6.23 (release 720 - 27.03.12 - 17:30:00).

    unicode enabled version

    E:\usr\sap\PRD\SUM\abap\exe\R3trans.exe finished (0004).

    R3trans=>sapparam(1c): No Profile used.

    R3trans=>sapparam: SAPSYSTEMNAME neither in Profile nor in Commandline

    This is E:\usr\sap\PRD\SUM\abap\exe\R3trans.exe version 6.23 (release 720 - 27.03.12 - 17:30:00).

    unicode enabled version

    E:\usr\sap\PRD\SUM\abap\exe\R3trans.exe finished (0004).

    R3trans=>sapparam(1c): No Profile used.

    R3trans=>sapparam: SAPSYSTEMNAME neither in Profile nor in Commandline

    This is E:\usr\sap\PRD\SUM\abap\exe\R3trans.exe version 6.23 (release 720 - 27.03.12 - 17:30:00).

    unicode enabled version

    E:\usr\sap\PRD\SUM\abap\exe\R3trans.exe finished (0004).

    R3trans=>sapparam(1c): No Profile used.

    R3trans=>sapparam: SAPSYSTEMNAME neither in Profile nor in Commandline

    This is E:\usr\sap\PRD\SUM\abap\exe\R3trans.exe version 6.23 (release 720 - 27.03.12 - 17:30:00).

    unicode enabled version

    E:\usr\sap\PRD\SUM\abap\exe\R3trans.exe finished (0004).

    R3trans=>sapparam(1c): No Profile used.

    R3trans=>sapparam: SAPSYSTEMNAME neither in Profile nor in Commandline

    This is E:\usr\sap\PRD\SUM\abap\exe\R3trans.exe version 6.23 (release 720 - 27.03.12 - 17:30:00).

    unicode enabled version

    E:\usr\sap\PRD\SUM\abap\exe\R3trans.exe finished (0004).

    R3trans=>sapparam(1c): No Profile used.

    R3trans=>sapparam: SAPSYSTEMNAME neither in Profile nor in Commandline

    This is E:\usr\sap\PRD\SUM\abap\exe\R3trans.exe version 6.23 (release 720 - 27.03.12 - 17:30:00).

    unicode enabled version

    E:\usr\sap\PRD\SUM\abap\exe\R3trans.exe finished (0004).

    R3trans=>sapparam(1c): No Profile used.

    R3trans=>sapparam: SAPSYSTEMNAME neither in Profile nor in Commandline

    This is E:\usr\sap\PRD\SUM\abap\exe\R3trans.exe version 6.23 (release 720 - 27.03.12 - 17:30:00).

    unicode enabled version

    E:\usr\sap\PRD\SUM\abap\exe\R3trans.exe finished (0004).

    R3trans=>sapparam(1c): No Profile used.

    R3trans=>sapparam: SAPSYSTEMNAME neither in Profile nor in Commandline

    This is E:\usr\sap\PRD\SUM\abap\exe\R3trans.exe version 6.23 (release 720 - 27.03.12 - 17:30:00).

    unicode enabled version

    E:\usr\sap\PRD\SUM\abap\exe\R3trans.exe finished (0004).

    R3trans=>sapparam(1c): No Profile used.

    R3trans=>sapparam: SAPSYSTEMNAME neither in Profile nor in Commandline

    This is E:\usr\sap\PRD\SUM\abap\exe\R3trans.exe version 6.23 (release 720 - 27.03.12 - 17:30:00).

    unicode enabled version

    E:\usr\sap\PRD\SUM\abap\exe\R3trans.exe finished (0004).

    R3trans=>sapparam(1c): No Profile used.

    R3trans=>sapparam: SAPSYSTEMNAME neither in Profile nor in Commandline

    This is E:\usr\sap\PRD\SUM\abap\exe\R3trans.exe version 6.23 (release 720 - 27.03.12 - 17:30:00).

    unicode enabled version

    E:\usr\sap\PRD\SUM\abap\exe\R3trans.exe finished (0004).

    R3trans=>sapparam(1c): No Profile used.

    R3trans=>sapparam: SAPSYSTEMNAME neither in Profile nor in Commandline

    This is E:\usr\sap\PRD\SUM\abap\exe\R3trans.exe version 6.23 (release 720 - 27.03.12 - 17:30:00).

    unicode enabled version

    E:\usr\sap\PRD\SUM\abap\exe\R3trans.exe finished (0004).

    R3trans=>sapparam(1c): No Profile used.

    R3trans=>sapparam: SAPSYSTEMNAME neither in Profile nor in Commandline

    This is E:\usr\sap\PRD\SUM\abap\exe\R3trans.exe version 6.23 (release 720 - 27.03.12 - 17:30:00).

    unicode enabled version

    E:\usr\sap\PRD\SUM\abap\exe\R3trans.exe finished (0004).

    R3trans=>sapparam(1c): No Profile used.

    R3trans=>sapparam: SAPSYSTEMNAME neither in Profile nor in Commandline

    This is E:\usr\sap\PRD\SUM\abap\exe\R3trans.exe version 6.23 (release 720 - 27.03.12 - 17:30:00).

    unicode enabled version

    E:\usr\sap\PRD\SUM\abap\exe\R3trans.exe finished (0004).

    R3trans=>sapparam(1c): No Profile used.

    R3trans=>sapparam: SAPSYSTEMNAME neither in Profile nor in Commandline

    This is E:\usr\sap\PRD\SUM\abap\exe\R3trans.exe version 6.23 (release 720 - 27.03.12 - 17:30:00).

    unicode enabled version

    E:\usr\sap\PRD\SUM\abap\exe\R3trans.exe finished (0004).

    R3trans=>sapparam(1c): No Profile used.

    R3trans=>sapparam: SAPSYSTEMNAME neither in Profile nor in Commandline

    This is E:\usr\sap\PRD\SUM\abap\exe\R3trans.exe version 6.23 (release 720 - 27.03.12 - 17:30:00).

    unicode enabled version

    E:\usr\sap\PRD\SUM\abap\exe\R3trans.exe finished (0004).

    R3trans=>sapparam(1c): No Profile used.

    R3trans=>sapparam: SAPSYSTEMNAME neither in Profile nor in Commandline

    This is E:\usr\sap\PRD\SUM\abap\exe\R3trans.exe version 6.23 (release 720 - 27.03.12 - 17:30:00).

    unicode enabled version

    E:\usr\sap\PRD\SUM\abap\exe\R3trans.exe finished (0000).

    R3trans=>sapparam(1c): No Profile used.

    R3trans=>sapparam: SAPSYSTEMNAME neither in Profile nor in Commandline

    This is E:\usr\sap\PRD\SUM\abap\exe\R3trans.exe version 6.23 (release 720 - 27.03.12 - 17:30:00).

    unicode enabled version

    E:\usr\sap\PRD\SUM\abap\exe\R3trans.exe finished (0004).

    R3trans=>sapparam(1c): No Profile used.

    R3trans=>sapparam: SAPSYSTEMNAME neither in Profile nor in Commandline

    This is E:\usr\sap\PRD\SUM\abap\exe\R3trans.exe version 6.23 (release 720 - 27.03.12 - 17:30:00).

    unicode enabled version

    E:\usr\sap\PRD\SUM\abap\exe\R3trans.exe finished (0004).

    R3trans=>sapparam(1c): No Profile used.

    R3trans=>sapparam: SAPSYSTEMNAME neither in Profile nor in Commandline

    This is E:\usr\sap\PRD\SUM\abap\exe\R3trans.exe version 6.23 (release 720 - 27.03.12 - 17:30:00).

    unicode enabled version

    E:\usr\sap\PRD\SUM\abap\exe\R3trans.exe finished (0004).

    R3trans=>sapparam(1c): No Profile used.

    R3trans=>sapparam: SAPSYSTEMNAME neither in Profile nor in Commandline

    This is E:\usr\sap\PRD\SUM\abap\exe\R3trans.exe version 6.23 (release 720 - 27.03.12 - 17:30:00).

    unicode enabled version

    E:\usr\sap\PRD\SUM\abap\exe\R3trans.exe finished (0004).

    R3trans=>sapparam(1c): No Profile used.

    R3trans=>sapparam: SAPSYSTEMNAME neither in Profile nor in Commandline

    This is E:\usr\sap\PRD\SUM\abap\exe\R3trans.exe version 6.23 (release 720 - 27.03.12 - 17:30:00).

    unicode enabled version

    E:\usr\sap\PRD\SUM\abap\exe\R3trans.exe finished (0000).

    R3trans=>sapparam(1c): No Profile used.

    R3trans=>sapparam: SAPSYSTEMNAME neither in Profile nor in Commandline

    This is E:\usr\sap\PRD\SUM\abap\exe\R3trans.exe version 6.23 (release 720 - 27.03.12 - 17:30:00).

    unicode enabled version

    E:\usr\sap\PRD\SUM\abap\exe\R3trans.exe finished (0004).

    R3trans=>sapparam(1c): No Profile used.

    R3trans=>sapparam: SAPSYSTEMNAME neither in Profile nor in Commandline

    This is E:\usr\sap\PRD\SUM\abap\exe\R3trans.exe version 6.23 (release 720 - 27.03.12 - 17:30:00).

    unicode enabled version

    E:\usr\sap\PRD\SUM\abap\exe\R3trans.exe finished (0004).

    R3trans=>sapparam(1c): No Profile used.

    R3trans=>sapparam: SAPSYSTEMNAME neither in Profile nor in Commandline

    This is E:\usr\sap\PRD\SUM\abap\exe\R3trans.exe version 6.23 (release 720 - 27.03.12 - 17:30:00).

    unicode enabled version

    E:\usr\sap\PRD\SUM\abap\exe\R3trans.exe finished (0000).

    R3trans=>sapparam(1c): No Profile used.

    R3trans=>sapparam: SAPSYSTEMNAME neither in Profile nor in Commandline

    This is E:\usr\sap\PRD\SUM\abap\exe\R3trans.exe version 6.23 (release 720 - 27.03.12 - 17:30:00).

    unicode enabled version

    E:\usr\sap\PRD\SUM\abap\exe\R3trans.exe finished (0000).

    R3trans=>sapparam(1c): No Profile used.

    R3trans=>sapparam: SAPSYSTEMNAME neither in Profile nor in Commandline

    This is E:\usr\sap\PRD\SUM\abap\exe\R3trans.exe version 6.23 (release 720 - 27.03.12 - 17:30:00).

    unicode enabled version

    E:\usr\sap\PRD\SUM\abap\exe\R3trans.exe finished (0000).

    R3trans=>sapparam(1c): No Profile used.

    R3trans=>sapparam: SAPSYSTEMNAME neither in Profile nor in Commandline

    This is E:\usr\sap\PRD\SUM\abap\exe\R3trans.exe version 6.23 (release 720 - 27.03.12 - 17:30:00).

    unicode enabled version

    E:\usr\sap\PRD\SUM\abap\exe\R3trans.exe finished (0004).

    R3trans=>sapparam(1c): No Profile used.

    R3trans=>sapparam: SAPSYSTEMNAME neither in Profile nor in Commandline

    This is E:\usr\sap\PRD\SUM\abap\exe\R3trans.exe version 6.23 (release 720 - 27.03.12 - 17:30:00).

    unicode enabled version

    E:\usr\sap\PRD\SUM\abap\exe\R3trans.exe finished (0004).

    R3trans=>sapparam(1c): No Profile used.

    R3trans=>sapparam: SAPSYSTEMNAME neither in Profile nor in Commandline

    This is E:\usr\sap\PRD\SUM\abap\exe\R3trans.exe version 6.23 (release 720 - 27.03.12 - 17:30:00).

    unicode enabled version

    E:\usr\sap\PRD\SUM\abap\exe\R3trans.exe finished (0004).

    R3trans=>sapparam(1c): No Profile used.

    R3trans=>sapparam: SAPSYSTEMNAME neither in Profile nor in Commandline

    This is E:\usr\sap\PRD\SUM\abap\exe\R3trans.exe version 6.23 (release 720 - 27.03.12 - 17:30:00).

    unicode enabled version

    E:\usr\sap\PRD\SUM\abap\exe\R3trans.exe finished (0004).

    R3trans=>sapparam(1c): No Profile used.

    R3trans=>sapparam: SAPSYSTEMNAME neither in Profile nor in Commandline

    This is E:\usr\sap\PRD\SUM\abap\exe\R3trans.exe version 6.23 (release 720 - 27.03.12 - 17:30:00).

    unicode enabled version

    E:\usr\sap\PRD\SUM\abap\exe\R3trans.exe finished (0004).

    R3trans=>sapparam(1c): No Profile used.

    R3trans=>sapparam: SAPSYSTEMNAME neither in Profile nor in Commandline

    This is E:\usr\sap\PRD\SUM\abap\exe\R3trans.exe version 6.23 (release 720 - 27.03.12 - 17:30:00).

    unicode enabled version

    E:\usr\sap\PRD\SUM\abap\exe\R3trans.exe finished (0004).

    R3trans=>sapparam(1c): No Profile used.

    R3trans=>sapparam: SAPSYSTEMNAME neither in Profile nor in Commandline

    This is E:\usr\sap\PRD\SUM\abap\exe\R3trans.exe version 6.23 (release 720 - 27.03.12 - 17:30:00).

    unicode enabled version

    E:\usr\sap\PRD\SUM\abap\exe\R3trans.exe finished (0004).

    R3trans=>sapparam(1c): No Profile used.

    R3trans=>sapparam: SAPSYSTEMNAME neither in Profile nor in Commandline

    This is E:\usr\sap\PRD\SUM\abap\exe\R3trans.exe version 6.23 (release 720 - 27.03.12 - 17:30:00).

    unicode enabled version

    E:\usr\sap\PRD\SUM\abap\exe\R3trans.exe finished (0004).

    R3trans=>sapparam(1c): No Profile used.

    R3trans=>sapparam: SAPSYSTEMNAME neither in Profile nor in Commandline

    This is E:\usr\sap\PRD\SUM\abap\exe\R3trans.exe version 6.23 (release 720 - 27.03.12 - 17:30:00).

    unicode enabled version

    E:\usr\sap\PRD\SUM\abap\exe\R3trans.exe finished (0004).

    R3trans=>sapparam(1c): No Profile used.

    R3trans=>sapparam: SAPSYSTEMNAME neither in Profile nor in Commandline

    This is E:\usr\sap\PRD\SUM\abap\exe\R3trans.exe version 6.23 (release 720 - 27.03.12 - 17:30:00).

    unicode enabled version

    E:\usr\sap\PRD\SUM\abap\exe\R3trans.exe finished (0004).

    R3trans=>sapparam(1c): No Profile used.

    R3trans=>sapparam: SAPSYSTEMNAME neither in Profile nor in Commandline

    This is E:\usr\sap\PRD\SUM\abap\exe\R3trans.exe version 6.23 (release 720 - 27.03.12 - 17:30:00).

    unicode enabled version

    E:\usr\sap\PRD\SUM\abap\exe\R3trans.exe finished (0004).

    R3trans=>sapparam(1c): No Profile used.

    R3trans=>sapparam: SAPSYSTEMNAME neither in Profile nor in Commandline

    This is E:\usr\sap\PRD\SUM\abap\exe\R3trans.exe version 6.23 (release 720 - 27.03.12 - 17:30:00).

    unicode enabled version

    E:\usr\sap\PRD\SUM\abap\exe\R3trans.exe finished (0004).

    R3trans=>sapparam(1c): No Profile used.

    R3trans=>sapparam: SAPSYSTEMNAME neither in Profile nor in Commandline

    This is E:\usr\sap\PRD\SUM\abap\exe\R3trans.exe version 6.23 (release 720 - 27.03.12 - 17:30:00).

    unicode enabled version

    E:\usr\sap\PRD\SUM\abap\exe\R3trans.exe finished (0004).

    R3trans=>sapparam(1c): No Profile used.

    R3trans=>sapparam: SAPSYSTEMNAME neither in Profile nor in Commandline

    This is E:\usr\sap\PRD\SUM\abap\exe\R3trans.exe version 6.23 (release 720 - 27.03.12 - 17:30:00).

    unicode enabled version

    E:\usr\sap\PRD\SUM\abap\exe\R3trans.exe finished (0000).

    R3trans=>sapparam(1c): No Profile used.

    R3trans=>sapparam: SAPSYSTEMNAME neither in Profile nor in Commandline

    This is E:\usr\sap\PRD\SUM\abap\exe\R3trans.exe version 6.23 (release 720 - 27.03.12 - 17:30:00).

    unicode enabled version

    E:\usr\sap\PRD\SUM\abap\exe\R3trans.exe finished (0000).

    R3trans=>sapparam(1c): No Profile used.

    R3trans=>sapparam: SAPSYSTEMNAME neither in Profile nor in Commandline

    This is E:\usr\sap\PRD\SUM\abap\exe\R3trans.exe version 6.23 (release 720 - 27.03.12 - 17:30:00).

    unicode enabled version

    E:\usr\sap\PRD\SUM\abap\exe\R3trans.exe finished (0000).

    R3trans=>sapparam(1c): No Profile used.

    R3trans=>sapparam: SAPSYSTEMNAME neither in Profile nor in Commandline

    This is E:\usr\sap\PRD\SUM\abap\exe\R3trans.exe version 6.23 (release 720 - 27.03.12 - 17:30:00).

    unicode enabled version

    E:\usr\sap\PRD\SUM\abap\exe\R3trans.exe finished (0000).

    R3trans=>sapparam(1c): No Profile used.

    R3trans=>sapparam: SAPSYSTEMNAME neither in Profile nor in Commandline

    This is E:\usr\sap\PRD\SUM\abap\exe\R3trans.exe version 6.23 (release 720 - 27.03.12 - 17:30:00).

    unicode enabled version

    E:\usr\sap\PRD\SUM\abap\exe\R3trans.exe finished (0004).

    R3trans=>sapparam(1c): No Profile used.

    R3trans=>sapparam: SAPSYSTEMNAME neither in Profile nor in Commandline

    This is E:\usr\sap\PRD\SUM\abap\exe\R3trans.exe version 6.23 (release 720 - 27.03.12 - 17:30:00).

    unicode enabled version

    E:\usr\sap\PRD\SUM\abap\exe\R3trans.exe finished (0000).

    R3trans=>sapparam(1c): No Profile used.

    R3trans=>sapparam: SAPSYSTEMNAME neither in Profile nor in Commandline

    This is E:\usr\sap\PRD\SUM\abap\exe\R3trans.exe version 6.23 (release 720 - 27.03.12 - 17:30:00).

    unicode enabled version

    E:\usr\sap\PRD\SUM\abap\exe\R3trans.exe finished (0000).

    R3trans=>sapparam(1c): No Profile used.

    R3trans=>sapparam: SAPSYSTEMNAME neither in Profile nor in Commandline

    This is E:\usr\sap\PRD\SUM\abap\exe\R3trans.exe version 6.23 (release 720 - 27.03.12 - 17:30:00).

    unicode enabled version

    E:\usr\sap\PRD\SUM\abap\exe\R3trans.exe finished (0000).

    R3trans=>sapparam(1c): No Profile used.

    R3trans=>sapparam: SAPSYSTEMNAME neither in Profile nor in Commandline

    This is E:\usr\sap\PRD\SUM\abap\exe\R3trans.exe version 6.23 (release 720 - 27.03.12 - 17:30:00).

    unicode enabled version

    E:\usr\sap\PRD\SUM\abap\exe\R3trans.exe finished (0004).

    R3trans=>sapparam(1c): No Profile used.

    R3trans=>sapparam: SAPSYSTEMNAME neither in Profile nor in Commandline

    This is E:\usr\sap\PRD\SUM\abap\exe\R3trans.exe version 6.23 (release 720 - 27.03.12 - 17:30:00).

    unicode enabled version

    E:\usr\sap\PRD\SUM\abap\exe\R3trans.exe finished (0004).

    R3trans=>sapparam(1c): No Profile used.

    R3trans=>sapparam: SAPSYSTEMNAME neither in Profile nor in Commandline

    This is E:\usr\sap\PRD\SUM\abap\exe\R3trans.exe version 6.23 (release 720 - 27.03.12 - 17:30:00).

    unicode enabled version

    E:\usr\sap\PRD\SUM\abap\exe\R3trans.exe finished (0004).

    R3trans=>sapparam(1c): No Profile used.

    R3trans=>sapparam: SAPSYSTEMNAME neither in Profile nor in Commandline

    This is E:\usr\sap\PRD\SUM\abap\exe\R3trans.exe version 6.23 (release 720 - 27.03.12 - 17:30:00).

    unicode enabled version

    E:\usr\sap\PRD\SUM\abap\exe\R3trans.exe finished (0004).

    R3trans=>sapparam(1c): No Profile used.

    R3trans=>sapparam: SAPSYSTEMNAME neither in Profile nor in Commandline

    This is E:\usr\sap\PRD\SUM\abap\exe\R3trans.exe version 6.23 (release 720 - 27.03.12 - 17:30:00).

    unicode enabled version

    E:\usr\sap\PRD\SUM\abap\exe\R3trans.exe finished (0004).

    R3trans=>sapparam(1c): No Profile used.

    R3trans=>sapparam: SAPSYSTEMNAME neither in Profile nor in Commandline

    This is E:\usr\sap\PRD\SUM\abap\exe\R3trans.exe version 6.23 (release 720 - 27.03.12 - 17:30:00).

    unicode enabled version

    E:\usr\sap\PRD\SUM\abap\exe\R3trans.exe finished (0004).

    R3trans=>sapparam(1c): No Profile used.

    R3trans=>sapparam: SAPSYSTEMNAME neither in Profile nor in Commandline

    This is E:\usr\sap\PRD\SUM\abap\exe\R3trans.exe version 6.23 (release 720 - 27.03.12 - 17:30:00).

    unicode enabled version

    E:\usr\sap\PRD\SUM\abap\exe\R3trans.exe finished (0004).

    R3trans=>sapparam(1c): No Profile used.

    R3trans=>sapparam: SAPSYSTEMNAME neither in Profile nor in Commandline

    This is E:\usr\sap\PRD\SUM\abap\exe\R3trans.exe version 6.23 (release 720 - 27.03.12 - 17:30:00).

    unicode enabled version

    E:\usr\sap\PRD\SUM\abap\exe\R3trans.exe finished (0004).

    R3trans=>sapparam(1c): No Profile used.

    R3trans=>sapparam: SAPSYSTEMNAME neither in Profile nor in Commandline

    This is E:\usr\sap\PRD\SUM\abap\exe\R3trans.exe version 6.23 (release 720 - 27.03.12 - 17:30:00).

    unicode enabled version

    E:\usr\sap\PRD\SUM\abap\exe\R3trans.exe finished (0004).

    R3trans=>sapparam(1c): No Profile used.

    R3trans=>sapparam: SAPSYSTEMNAME neither in Profile nor in Commandline

    This is E:\usr\sap\PRD\SUM\abap\exe\R3trans.exe version 6.23 (release 720 - 27.03.12 - 17:30:00).

    unicode enabled version

    E:\usr\sap\PRD\SUM\abap\exe\R3trans.exe finished (0004).

    R3trans=>sapparam(1c): No Profile used.

    R3trans=>sapparam: SAPSYSTEMNAME neither in Profile nor in Commandline

    This is E:\usr\sap\PRD\SUM\abap\exe\R3trans.exe version 6.23 (release 720 - 27.03.12 - 17:30:00).

    unicode enabled version

    E:\usr\sap\PRD\SUM\abap\exe\R3trans.exe finished (0000).

    R3trans=>sapparam(1c): No Profile used.

    R3trans=>sapparam: SAPSYSTEMNAME neither in Profile nor in Commandline

    This is E:\usr\sap\PRD\SUM\abap\exe\R3trans.exe version 6.23 (release 720 - 27.03.12 - 17:30:00).

    unicode enabled version

    E:\usr\sap\PRD\SUM\abap\exe\R3trans.exe finished (0004).

    R3trans=>sapparam(1c): No Profile used.

    R3trans=>sapparam: SAPSYSTEMNAME neither in Profile nor in Commandline

    This is E:\usr\sap\PRD\SUM\abap\exe\R3trans.exe version 6.23 (release 720 - 27.03.12 - 17:30:00).

    unicode enabled version

    E:\usr\sap\PRD\SUM\abap\exe\R3trans.exe finished (0004).

    R3trans=>sapparam(1c): No Profile used.

    R3trans=>sapparam: SAPSYSTEMNAME neither in Profile nor in Commandline

    This is E:\usr\sap\PRD\SUM\abap\exe\R3trans.exe version 6.23 (release 720 - 27.03.12 - 17:30:00).

    unicode enabled version

    E:\usr\sap\PRD\SUM\abap\exe\R3trans.exe finished (0004).

    R3trans=>sapparam(1c): No Profile used.

    R3trans=>sapparam: SAPSYSTEMNAME neither in Profile nor in Commandline

    This is E:\usr\sap\PRD\SUM\abap\exe\R3trans.exe version 6.23 (release 720 - 27.03.12 - 17:30:00).

    unicode enabled version

    E:\usr\sap\PRD\SUM\abap\exe\R3trans.exe finished (0000).

    R3trans=>sapparam(1c): No Profile used.

    R3trans=>sapparam: SAPSYSTEMNAME neither in Profile nor in Commandline

    This is E:\usr\sap\PRD\SUM\abap\exe\R3trans.exe version 6.23 (release 720 - 27.03.12 - 17:30:00).

    unicode enabled version

    E:\usr\sap\PRD\SUM\abap\exe\R3trans.exe finished (0004).

    R3trans=>sapparam(1c): No Profile used.

    R3trans=>sapparam: SAPSYSTEMNAME neither in Profile nor in Commandline

    This is E:\usr\sap\PRD\SUM\abap\exe\R3trans.exe version 6.23 (release 720 - 27.03.12 - 17:30:00).

    unicode enabled version

    E:\usr\sap\PRD\SUM\abap\exe\R3trans.exe finished (0004).

    R3trans=>sapparam(1c): No Profile used.

    R3trans=>sapparam: SAPSYSTEMNAME neither in Profile nor in Commandline

    This is E:\usr\sap\PRD\SUM\abap\exe\R3trans.exe version 6.23 (release 720 - 27.03.12 - 17:30:00).

    unicode enabled version

    E:\usr\sap\PRD\SUM\abap\exe\R3trans.exe finished (0004).

    R3trans=>sapparam(1c): No Profile used.

    R3trans=>sapparam: SAPSYSTEMNAME neither in Profile nor in Commandline

    This is E:\usr\sap\PRD\SUM\abap\exe\R3trans.exe version 6.23 (release 720 - 27.03.12 - 17:30:00).

    unicode enabled version

    E:\usr\sap\PRD\SUM\abap\exe\R3trans.exe finished (0004).

    R3trans=>sapparam(1c): No Profile used.

    R3trans=>sapparam: SAPSYSTEMNAME neither in Profile nor in Commandline

    This is E:\usr\sap\PRD\SUM\abap\exe\R3trans.exe version 6.23 (release 720 - 27.03.12 - 17:30:00).

    unicode enabled version

    E:\usr\sap\PRD\SUM\abap\exe\R3trans.exe finished (0000).

    R3trans=>sapparam(1c): No Profile used.

    R3trans=>sapparam: SAPSYSTEMNAME neither in Profile nor in Commandline

    This is E:\usr\sap\PRD\SUM\abap\exe\R3trans.exe version 6.23 (release 720 - 27.03.12 - 17:30:00).

    unicode enabled version

    E:\usr\sap\PRD\SUM\abap\exe\R3trans.exe finished (0000).

    R3trans=>sapparam(1c): No Profile used.

    R3trans=>sapparam: SAPSYSTEMNAME neither in Profile nor in Commandline

    This is E:\usr\sap\PRD\SUM\abap\exe\R3trans.exe version 6.23 (release 720 - 27.03.12 - 17:30:00).

    unicode enabled version

    E:\usr\sap\PRD\SUM\abap\exe\R3trans.exe finished (0000).

    R3trans=>sapparam(1c): No Profile used.

    R3trans=>sapparam: SAPSYSTEMNAME neither in Profile nor in Commandline

    This is E:\usr\sap\PRD\SUM\abap\exe\R3trans.exe version 6.23 (release 720 - 27.03.12 - 17:30:00).

    unicode enabled version

    E:\usr\sap\PRD\SUM\abap\exe\R3trans.exe finished (0000).

    R3trans=>sapparam(1c): No Profile used.

    R3trans=>sapparam: SAPSYSTEMNAME neither in Profile nor in Commandline

    This is E:\usr\sap\PRD\SUM\abap\exe\R3trans.exe version 6.23 (release 720 - 27.03.12 - 17:30:00).

    unicode enabled version

    E:\usr\sap\PRD\SUM\abap\exe\R3trans.exe finished (0000).

    R3trans=>sapparam(1c): No Profile used.

    R3trans=>sapparam: SAPSYSTEMNAME neither in Profile nor in Commandline

    This is E:\usr\sap\PRD\SUM\abap\exe\R3trans.exe version 6.23 (release 720 - 27.03.12 - 17:30:00).

    unicode enabled version

    E:\usr\sap\PRD\SUM\abap\exe\R3trans.exe finished (0004).

    R3trans=>sapparam(1c): No Profile used.

    R3trans=>sapparam: SAPSYSTEMNAME neither in Profile nor in Commandline

    This is E:\usr\sap\PRD\SUM\abap\exe\R3trans.exe version 6.23 (release 720 - 27.03.12 - 17:30:00).

    unicode enabled version

    E:\usr\sap\PRD\SUM\abap\exe\R3trans.exe finished (0004).

    R3trans=>sapparam(1c): No Profile used.

    R3trans=>sapparam: SAPSYSTEMNAME neither in Profile nor in Commandline

    This is E:\usr\sap\PRD\SUM\abap\exe\R3trans.exe version 6.23 (release 720 - 27.03.12 - 17:30:00).

    unicode enabled version

    E:\usr\sap\PRD\SUM\abap\exe\R3trans.exe finished (0004).

    R3trans=>sapparam(1c): No Profile used.

    R3trans=>sapparam: SAPSYSTEMNAME neither in Profile nor in Commandline

    This is E:\usr\sap\PRD\SUM\abap\exe\R3trans.exe version 6.23 (release 720 - 27.03.12 - 17:30:00).

    unicode enabled version

    E:\usr\sap\PRD\SUM\abap\exe\R3trans.exe finished (0004).

    R3trans=>sapparam(1c): No Profile used.

    R3trans=>sapparam: SAPSYSTEMNAME neither in Profile nor in Commandline

    This is E:\usr\sap\PRD\SUM\abap\exe\R3trans.exe version 6.23 (release 720 - 27.03.12 - 17:30:00).

    unicode enabled version

    E:\usr\sap\PRD\SUM\abap\exe\R3trans.exe finished (0004).

    R3trans=>sapparam(1c): No Profile used.

    R3trans=>sapparam: SAPSYSTEMNAME neither in Profile nor in Commandline

    This is E:\usr\sap\PRD\SUM\abap\exe\R3trans.exe version 6.23 (release 720 - 27.03.12 - 17:30:00).

    unicode enabled version

    E:\usr\sap\PRD\SUM\abap\exe\R3trans.exe finished (0004).

    R3trans=>sapparam(1c): No Profile used.

    R3trans=>sapparam: SAPSYSTEMNAME neither in Profile nor in Commandline

    This is E:\usr\sap\PRD\SUM\abap\exe\R3trans.exe version 6.23 (release 720 - 27.03.12 - 17:30:00).

    unicode enabled version

    E:\usr\sap\PRD\SUM\abap\exe\R3trans.exe finished (0000).

    R3trans=>sapparam(1c): No Profile used.

    R3trans=>sapparam: SAPSYSTEMNAME neither in Profile nor in Commandline

    This is E:\usr\sap\PRD\SUM\abap\exe\R3trans.exe version 6.23 (release 720 - 27.03.12 - 17:30:00).

    unicode enabled version

    E:\usr\sap\PRD\SUM\abap\exe\R3trans.exe finished (0004).

    R3trans=>sapparam(1c): No Profile used.

    R3trans=>sapparam: SAPSYSTEMNAME neither in Profile nor in Commandline

    This is E:\usr\sap\PRD\SUM\abap\exe\R3trans.exe version 6.23 (release 720 - 27.03.12 - 17:30:00).

    unicode enabled version

    E:\usr\sap\PRD\SUM\abap\exe\R3trans.exe finished (0004).

    R3trans=>sapparam(1c): No Profile used.

    R3trans=>sapparam: SAPSYSTEMNAME neither in Profile nor in Commandline

    This is E:\usr\sap\PRD\SUM\abap\exe\R3trans.exe version 6.23 (release 720 - 27.03.12 - 17:30:00).

    unicode enabled version

    E:\usr\sap\PRD\SUM\abap\exe\R3trans.exe finished (0004).

    R3trans=>sapparam(1c): No Profile used.

    R3trans=>sapparam: SAPSYSTEMNAME neither in Profile nor in Commandline

    This is E:\usr\sap\PRD\SUM\abap\exe\R3trans.exe version 6.23 (release 720 - 27.03.12 - 17:30:00).

    unicode enabled version

    E:\usr\sap\PRD\SUM\abap\exe\R3trans.exe finished (0000).

    R3trans=>sapparam(1c): No Profile used.

    R3trans=>sapparam: SAPSYSTEMNAME neither in Profile nor in Commandline

    This is E:\usr\sap\PRD\SUM\abap\exe\R3trans.exe version 6.23 (release 720 - 27.03.12 - 17:30:00).

    unicode enabled version

    E:\usr\sap\PRD\SUM\abap\exe\R3trans.exe finished (0004).

    R3trans=>sapparam(1c): No Profile used.

    R3trans=>sapparam: SAPSYSTEMNAME neither in Profile nor in Commandline

    This is E:\usr\sap\PRD\SUM\abap\exe\R3trans.exe version 6.23 (release 720 - 27.03.12 - 17:30:00).

    unicode enabled version

    E:\usr\sap\PRD\SUM\abap\exe\R3trans.exe finished (0000).

    R3trans=>sapparam(1c): No Profile used.

    R3trans=>sapparam: SAPSYSTEMNAME neither in Profile nor in Commandline

    This is E:\usr\sap\PRD\SUM\abap\exe\R3trans.exe version 6.23 (release 720 - 27.03.12 - 17:30:00).

    unicode enabled version

    E:\usr\sap\PRD\SUM\abap\exe\R3trans.exe finished (0004).

    R3trans=>sapparam(1c): No Profile used.

    R3trans=>sapparam: SAPSYSTEMNAME neither in Profile nor in Commandline

    This is E:\usr\sap\PRD\SUM\abap\exe\R3trans.exe version 6.23 (release 720 - 27.03.12 - 17:30:00).

    unicode enabled version

    E:\usr\sap\PRD\SUM\abap\exe\R3trans.exe finished (0004).

    R3trans=>sapparam(1c): No Profile used.

    R3trans=>sapparam: SAPSYSTEMNAME neither in Profile nor in Commandline

    This is E:\usr\sap\PRD\SUM\abap\exe\R3trans.exe version 6.23 (release 720 - 27.03.12 - 17:30:00).

    unicode enabled version

    E:\usr\sap\PRD\SUM\abap\exe\R3trans.exe finished (0004).

    R3trans=>sapparam(1c): No Profile used.

    R3trans=>sapparam: SAPSYSTEMNAME neither in Profile nor in Commandline

    This is E:\usr\sap\PRD\SUM\abap\exe\R3trans.exe version 6.23 (release 720 - 27.03.12 - 17:30:00).

    unicode enabled version

    E:\usr\sap\PRD\SUM\abap\exe\R3trans.exe finished (0004).

    R3trans=>sapparam(1c): No Profile used.

    R3trans=>sapparam: SAPSYSTEMNAME neither in Profile nor in Commandline

    This is E:\usr\sap\PRD\SUM\abap\exe\R3trans.exe version 6.23 (release 720 - 27.03.12 - 17:30:00).

    unicode enabled version

    E:\usr\sap\PRD\SUM\abap\exe\R3trans.exe finished (0004).

    R3trans=>sapparam(1c): No Profile used.

    R3trans=>sapparam: SAPSYSTEMNAME neither in Profile nor in Commandline

    This is E:\usr\sap\PRD\SUM\abap\exe\R3trans.exe version 6.23 (release 720 - 27.03.12 - 17:30:00).

    unicode enabled version

    E:\usr\sap\PRD\SUM\abap\exe\R3trans.exe finished (0004).

    R3trans=>sapparam(1c): No Profile used.

    R3trans=>sapparam: SAPSYSTEMNAME neither in Profile nor in Commandline

    This is E:\usr\sap\PRD\SUM\abap\exe\R3trans.exe version 6.23 (release 720 - 27.03.12 - 17:30:00).

    unicode enabled version

    E:\usr\sap\PRD\SUM\abap\exe\R3trans.exe finished (0000).

    R3trans=>sapparam(1c): No Profile used.

    R3trans=>sapparam: SAPSYSTEMNAME neither in Profile nor in Commandline

    This is E:\usr\sap\PRD\SUM\abap\exe\R3trans.exe version 6.23 (release 720 - 27.03.12 - 17:30:00).

    unicode enabled version

    E:\usr\sap\PRD\SUM\abap\exe\R3trans.exe finished (0004).

    R3trans=>sapparam(1c): No Profile used.

    R3trans=>sapparam: SAPSYSTEMNAME neither in Profile nor in Commandline

    This is E:\usr\sap\PRD\SUM\abap\exe\R3trans.exe version 6.23 (release 720 - 27.03.12 - 17:30:00).

    unicode enabled version

    E:\usr\sap\PRD\SUM\abap\exe\R3trans.exe finished (0004).

    R3trans=>sapparam(1c): No Profile used.

    R3trans=>sapparam: SAPSYSTEMNAME neither in Profile nor in Commandline

    This is E:\usr\sap\PRD\SUM\abap\exe\R3trans.exe version 6.23 (release 720 - 27.03.12 - 17:30:00).

    unicode enabled version

    E:\usr\sap\PRD\SUM\abap\exe\R3trans.exe finished (0000).

    R3trans=>sapparam(1c): No Profile used.

    R3trans=>sapparam: SAPSYSTEMNAME neither in Profile nor in Commandline

    This is E:\usr\sap\PRD\SUM\abap\exe\R3trans.exe version 6.23 (release 720 - 27.03.12 - 17:30:00).

    unicode enabled version

    E:\usr\sap\PRD\SUM\abap\exe\R3trans.exe finished (0004).

    R3trans=>sapparam(1c): No Profile used.

    R3trans=>sapparam: SAPSYSTEMNAME neither in Profile nor in Commandline

    This is E:\usr\sap\PRD\SUM\abap\exe\R3trans.exe version 6.23 (release 720 - 27.03.12 - 17:30:00).

    unicode enabled version

    E:\usr\sap\PRD\SUM\abap\exe\R3trans.exe finished (0000).

    R3trans=>sapparam(1c): No Profile used.

    R3trans=>sapparam: SAPSYSTEMNAME neither in Profile nor in Commandline

    This is E:\usr\sap\PRD\SUM\abap\exe\R3trans.exe version 6.23 (release 720 - 27.03.12 - 17:30:00).

    unicode enabled version

    E:\usr\sap\PRD\SUM\abap\exe\R3trans.exe finished (0004).

    R3trans=>sapparam(1c): No Profile used.

    R3trans=>sapparam: SAPSYSTEMNAME neither in Profile nor in Commandline

    This is E:\usr\sap\PRD\SUM\abap\exe\R3trans.exe version 6.23 (release 720 - 27.03.12 - 17:30:00).

    unicode enabled version

    E:\usr\sap\PRD\SUM\abap\exe\R3trans.exe finished (0004).

    R3trans=>sapparam(1c): No Profile used.

    R3trans=>sapparam: SAPSYSTEMNAME neither in Profile nor in Commandline

    This is E:\usr\sap\PRD\SUM\abap\exe\R3trans.exe version 6.23 (release 720 - 27.03.12 - 17:30:00).

    unicode enabled version

    E:\usr\sap\PRD\SUM\abap\exe\R3trans.exe finished (0004).

    R3trans=>sapparam(1c): No Profile used.

    R3trans=>sapparam: SAPSYSTEMNAME neither in Profile nor in Commandline

    This is E:\usr\sap\PRD\SUM\abap\exe\R3trans.exe version 6.23 (release 720 - 27.03.12 - 17:30:00).

    unicode enabled version

    E:\usr\sap\PRD\SUM\abap\exe\R3trans.exe finished (0000).

    R3trans=>sapparam(1c): No Profile used.

    R3trans=>sapparam: SAPSYSTEMNAME neither in Profile nor in Commandline

    This is E:\usr\sap\PRD\SUM\abap\exe\R3trans.exe version 6.23 (release 720 - 27.03.12 - 17:30:00).

    unicode enabled version

    E:\usr\sap\PRD\SUM\abap\exe\R3trans.exe finished (0000).

    R3trans=>sapparam(1c): No Profile used.

    R3trans=>sapparam: SAPSYSTEMNAME neither in Profile nor in Commandline

    This is E:\usr\sap\PRD\SUM\abap\exe\R3trans.exe version 6.23 (release 720 - 27.03.12 - 17:30:00).

    unicode enabled version

    E:\usr\sap\PRD\SUM\abap\exe\R3trans.exe finished (0004).

    R3trans=>sapparam(1c): No Profile used.

    R3trans=>sapparam: SAPSYSTEMNAME neither in Profile nor in Commandline

    This is E:\usr\sap\PRD\SUM\abap\exe\R3trans.exe version 6.23 (release 720 - 27.03.12 - 17:30:00).

    unicode enabled version

    E:\usr\sap\PRD\SUM\abap\exe\R3trans.exe finished (0004).

    R3trans=>sapparam(1c): No Profile used.

    R3trans=>sapparam: SAPSYSTEMNAME neither in Profile nor in Commandline

    This is E:\usr\sap\PRD\SUM\abap\exe\R3trans.exe version 6.23 (release 720 - 27.03.12 - 17:30:00).

    unicode enabled version

    E:\usr\sap\PRD\SUM\abap\exe\R3trans.exe finished (0000).

    R3trans=>sapparam(1c): No Profile used.

    R3trans=>sapparam: SAPSYSTEMNAME neither in Profile nor in Commandline

    This is E:\usr\sap\PRD\SUM\abap\exe\R3trans.exe version 6.23 (release 720 - 27.03.12 - 17:30:00).

    unicode enabled version

    E:\usr\sap\PRD\SUM\abap\exe\R3trans.exe finished (0004).

    R3trans=>sapparam(1c): No Profile used.

    R3trans=>sapparam: SAPSYSTEMNAME neither in Profile nor in Commandline

    This is E:\usr\sap\PRD\SUM\abap\exe\R3trans.exe version 6.23 (release 720 - 27.03.12 - 17:30:00).

    unicode enabled version

    E:\usr\sap\PRD\SUM\abap\exe\R3trans.exe finished (0004).

    R3trans=>sapparam(1c): No Profile used.

    R3trans=>sapparam: SAPSYSTEMNAME neither in Profile nor in Commandline

    This is E:\usr\sap\PRD\SUM\abap\exe\R3trans.exe version 6.23 (release 720 - 27.03.12 - 17:30:00).

    unicode enabled version

    E:\usr\sap\PRD\SUM\abap\exe\R3trans.exe finished (0004).

    R3trans=>sapparam(1c): No Profile used.

    R3trans=>sapparam: SAPSYSTEMNAME neither in Profile nor in Commandline

    This is E:\usr\sap\PRD\SUM\abap\exe\R3trans.exe version 6.23 (release 720 - 27.03.12 - 17:30:00).

    unicode enabled version

    E:\usr\sap\PRD\SUM\abap\exe\R3trans.exe finished (0004).

    R3trans=>sapparam(1c): No Profile used.

    R3trans=>sapparam: SAPSYSTEMNAME neither in Profile nor in Commandline

    This is E:\usr\sap\PRD\SUM\abap\exe\R3trans.exe version 6.23 (release 720 - 27.03.12 - 17:30:00).

    unicode enabled version

    E:\usr\sap\PRD\SUM\abap\exe\R3trans.exe finished (0004).

    R3trans=>sapparam(1c): No Profile used.

    R3trans=>sapparam: SAPSYSTEMNAME neither in Profile nor in Commandline

    This is E:\usr\sap\PRD\SUM\abap\exe\R3trans.exe version 6.23 (release 720 - 27.03.12 - 17:30:00).

    unicode enabled version

    E:\usr\sap\PRD\SUM\abap\exe\R3trans.exe finished (0004).

    R3trans=>sapparam(1c): No Profile used.

    R3trans=>sapparam: SAPSYSTEMNAME neither in Profile nor in Commandline

    This is E:\usr\sap\PRD\SUM\abap\exe\R3trans.exe version 6.23 (release 720 - 27.03.12 - 17:30:00).

    unicode enabled version

    E:\usr\sap\PRD\SUM\abap\exe\R3trans.exe finished (0004).

    R3trans=>sapparam(1c): No Profile used.

    R3trans=>sapparam: SAPSYSTEMNAME neither in Profile nor in Commandline

    This is E:\usr\sap\PRD\SUM\abap\exe\R3trans.exe version 6.23 (release 720 - 27.03.12 - 17:30:00).

    unicode enabled version

    E:\usr\sap\PRD\SUM\abap\exe\R3trans.exe finished (0004).

    R3trans=>sapparam(1c): No Profile used.

    R3trans=>sapparam: SAPSYSTEMNAME neither in Profile nor in Commandline

    This is E:\usr\sap\PRD\SUM\abap\exe\R3trans.exe version 6.23 (release 720 - 27.03.12 - 17:30:00).

    unicode enabled version

    E:\usr\sap\PRD\SUM\abap\exe\R3trans.exe finished (0004).

    R3trans=>sapparam(1c): No Profile used.

    R3trans=>sapparam: SAPSYSTEMNAME neither in Profile nor in Commandline

    This is E:\usr\sap\PRD\SUM\abap\exe\R3trans.exe version 6.23 (release 720 - 27.03.12 - 17:30:00).

    unicode enabled version

    E:\usr\sap\PRD\SUM\abap\exe\R3trans.exe finished (0000).

    R3trans=>sapparam(1c): No Profile used.

    R3trans=>sapparam: SAPSYSTEMNAME neither in Profile nor in Commandline

    This is E:\usr\sap\PRD\SUM\abap\exe\R3trans.exe version 6.23 (release 720 - 27.03.12 - 17:30:00).

    unicode enabled version

    E:\usr\sap\PRD\SUM\abap\exe\R3trans.exe finished (0004).

    R3trans=>sapparam(1c): No Profile used.

    R3trans=>sapparam: SAPSYSTEMNAME neither in Profile nor in Commandline

    This is E:\usr\sap\PRD\SUM\abap\exe\R3trans.exe version 6.23 (release 720 - 27.03.12 - 17:30:00).

    unicode enabled version

    E:\usr\sap\PRD\SUM\abap\exe\R3trans.exe finished (0000).

    R3trans=>sapparam(1c): No Profile used.

    R3trans=>sapparam: SAPSYSTEMNAME neither in Profile nor in Commandline

    This is E:\usr\sap\PRD\SUM\abap\exe\R3trans.exe version 6.23 (release 720 - 27.03.12 - 17:30:00).

    unicode enabled version

    E:\usr\sap\PRD\SUM\abap\exe\R3trans.exe finished (0000).

    R3trans=>sapparam(1c): No Profile used.

    R3trans=>sapparam: SAPSYSTEMNAME neither in Profile nor in Commandline

    This is E:\usr\sap\PRD\SUM\abap\exe\R3trans.exe version 6.23 (release 720 - 27.03.12 - 17:30:00).

    unicode enabled version

    E:\usr\sap\PRD\SUM\abap\exe\R3trans.exe finished (0004).

    R3trans=>sapparam(1c): No Profile used.

    R3trans=>sapparam: SAPSYSTEMNAME neither in Profile nor in Commandline

    This is E:\usr\sap\PRD\SUM\abap\exe\R3trans.exe version 6.23 (release 720 - 27.03.12 - 17:30:00).

    unicode enabled version

    E:\usr\sap\PRD\SUM\abap\exe\R3trans.exe finished (0004).

    R3trans=>sapparam(1c): No Profile used.

    R3trans=>sapparam: SAPSYSTEMNAME neither in Profile nor in Commandline

    This is E:\usr\sap\PRD\SUM\abap\exe\R3trans.exe version 6.23 (release 720 - 27.03.12 - 17:30:00).

    unicode enabled version

    E:\usr\sap\PRD\SUM\abap\exe\R3trans.exe finished (0000).

    R3trans=>sapparam(1c): No Profile used.

    R3trans=>sapparam: SAPSYSTEMNAME neither in Profile nor in Commandline

    This is E:\usr\sap\PRD\SUM\abap\exe\R3trans.exe version 6.23 (release 720 - 27.03.12 - 17:30:00).

    unicode enabled version

    E:\usr\sap\PRD\SUM\abap\exe\R3trans.exe finished (0000).

    R3trans=>sapparam(1c): No Profile used.

    R3trans=>sapparam: SAPSYSTEMNAME neither in Profile nor in Commandline

    This is E:\usr\sap\PRD\SUM\abap\exe\R3trans.exe version 6.23 (release 720 - 27.03.12 - 17:30:00).

    unicode enabled version

    E:\usr\sap\PRD\SUM\abap\exe\R3trans.exe finished (0004).

    R3trans=>sapparam(1c): No Profile used.

    R3trans=>sapparam: SAPSYSTEMNAME neither in Profile nor in Commandline

    This is E:\usr\sap\PRD\SUM\abap\exe\R3trans.exe version 6.23 (release 720 - 27.03.12 - 17:30:00).

    unicode enabled version

    E:\usr\sap\PRD\SUM\abap\exe\R3trans.exe finished (0004).

    R3trans=>sapparam(1c): No Profile used.

    R3trans=>sapparam: SAPSYSTEMNAME neither in Profile nor in Commandline

    This is E:\usr\sap\PRD\SUM\abap\exe\R3trans.exe version 6.23 (release 720 - 27.03.12 - 17:30:00).

    unicode enabled version

    E:\usr\sap\PRD\SUM\abap\exe\R3trans.exe finished (0000).

    R3trans=>sapparam(1c): No Profile used.

    R3trans=>sapparam: SAPSYSTEMNAME neither in Profile nor in Commandline

    This is E:\usr\sap\PRD\SUM\abap\exe\R3trans.exe version 6.23 (release 720 - 27.03.12 - 17:30:00).

    unicode enabled version

    E:\usr\sap\PRD\SUM\abap\exe\R3trans.exe finished (0000).

    R3trans=>sapparam(1c): No Profile used.

    R3trans=>sapparam: SAPSYSTEMNAME neither in Profile nor in Commandline

    This is E:\usr\sap\PRD\SUM\abap\exe\R3trans.exe version 6.23 (release 720 - 27.03.12 - 17:30:00).

    unicode enabled version

    E:\usr\sap\PRD\SUM\abap\exe\R3trans.exe finished (0000).

    R3trans=>sapparam(1c): No Profile used.

    R3trans=>sapparam: SAPSYSTEMNAME neither in Profile nor in Commandline

    This is E:\usr\sap\PRD\SUM\abap\exe\R3trans.exe version 6.23 (release 720 - 27.03.12 - 17:30:00).

    unicode enabled version

    E:\usr\sap\PRD\SUM\abap\exe\R3trans.exe finished (0004).

    R3trans=>sapparam(1c): No Profile used.

    R3trans=>sapparam: SAPSYSTEMNAME neither in Profile nor in Commandline

    This is E:\usr\sap\PRD\SUM\abap\exe\R3trans.exe version 6.23 (release 720 - 27.03.12 - 17:30:00).

    unicode enabled version

    E:\usr\sap\PRD\SUM\abap\exe\R3trans.exe finished (0000).

    R3trans=>sapparam(1c): No Profile used.

    R3trans=>sapparam: SAPSYSTEMNAME neither in Profile nor in Commandline

    This is E:\usr\sap\PRD\SUM\abap\exe\R3trans.exe version 6.23 (release 720 - 27.03.12 - 17:30:00).

    unicode enabled version

    E:\usr\sap\PRD\SUM\abap\exe\R3trans.exe finished (0000).

    R3trans=>sapparam(1c): No Profile used.

    R3trans=>sapparam: SAPSYSTEMNAME neither in Profile nor in Commandline

    This is E:\usr\sap\PRD\SUM\abap\exe\R3trans.exe version 6.23 (release 720 - 27.03.12 - 17:30:00).

    unicode enabled version

    E:\usr\sap\PRD\SUM\abap\exe\R3trans.exe finished (0004).

    R3trans=>sapparam(1c): No Profile used.

    R3trans=>sapparam: SAPSYSTEMNAME neither in Profile nor in Commandline

    This is E:\usr\sap\PRD\SUM\abap\exe\R3trans.exe version 6.23 (release 720 - 27.03.12 - 17:30:00).

    unicode enabled version

    E:\usr\sap\PRD\SUM\abap\exe\R3trans.exe finished (0004).

    R3trans=>sapparam(1c): No Profile used.

    R3trans=>sapparam: SAPSYSTEMNAME neither in Profile nor in Commandline

    This is E:\usr\sap\PRD\SUM\abap\exe\R3trans.exe version 6.23 (release 720 - 27.03.12 - 17:30:00).

    unicode enabled version

    E:\usr\sap\PRD\SUM\abap\exe\R3trans.exe finished (0000).

    R3trans=>sapparam(1c): No Profile used.

    R3trans=>sapparam: SAPSYSTEMNAME neither in Profile nor in Commandline

    This is E:\usr\sap\PRD\SUM\abap\exe\R3trans.exe version 6.23 (release 720 - 27.03.12 - 17:30:00).

    unicode enabled version

    E:\usr\sap\PRD\SUM\abap\exe\R3trans.exe finished (0000).

    R3trans=>sapparam(1c): No Profile used.

    R3trans=>sapparam: SAPSYSTEMNAME neither in Profile nor in Commandline

    This is E:\usr\sap\PRD\SUM\abap\exe\R3trans.exe version 6.23 (release 720 - 27.03.12 - 17:30:00).

    unicode enabled version

    E:\usr\sap\PRD\SUM\abap\exe\R3trans.exe finished (0004).

    R3trans=>sapparam(1c): No Profile used.

    R3trans=>sapparam: SAPSYSTEMNAME neither in Profile nor in Commandline

    This is E:\usr\sap\PRD\SUM\abap\exe\R3trans.exe version 6.23 (release 720 - 27.03.12 - 17:30:00).

    unicode enabled version

    E:\usr\sap\PRD\SUM\abap\exe\R3trans.exe finished (0004).

    R3trans=>sapparam(1c): No Profile used.

    R3trans=>sapparam: SAPSYSTEMNAME neither in Profile nor in Commandline

    This is E:\usr\sap\PRD\SUM\abap\exe\R3trans.exe version 6.23 (release 720 - 27.03.12 - 17:30:00).

    unicode enabled version

    E:\usr\sap\PRD\SUM\abap\exe\R3trans.exe finished (0000).

    R3trans=>sapparam(1c): No Profile used.

    R3trans=>sapparam: SAPSYSTEMNAME neither in Profile nor in Commandline

    This is E:\usr\sap\PRD\SUM\abap\exe\R3trans.exe version 6.23 (release 720 - 27.03.12 - 17:30:00).

    unicode enabled version

    E:\usr\sap\PRD\SUM\abap\exe\R3trans.exe finished (0000).

    R3trans=>sapparam(1c): No Profile used.

    R3trans=>sapparam: SAPSYSTEMNAME neither in Profile nor in Commandline

    This is E:\usr\sap\PRD\SUM\abap\exe\R3trans.exe version 6.23 (release 720 - 27.03.12 - 17:30:00).

    unicode enabled version

    E:\usr\sap\PRD\SUM\abap\exe\R3trans.exe finished (0004).

    R3trans=>sapparam(1c): No Profile used.

    R3trans=>sapparam: SAPSYSTEMNAME neither in Profile nor in Commandline

    This is E:\usr\sap\PRD\SUM\abap\exe\R3trans.exe version 6.23 (release 720 - 27.03.12 - 17:30:00).

    unicode enabled version

    E:\usr\sap\PRD\SUM\abap\exe\R3trans.exe finished (0000).

    R3trans=>sapparam(1c): No Profile used.

    R3trans=>sapparam: SAPSYSTEMNAME neither in Profile nor in Commandline

    This is E:\usr\sap\PRD\SUM\abap\exe\R3trans.exe version 6.23 (release 720 - 27.03.12 - 17:30:00).

    unicode enabled version

    E:\usr\sap\PRD\SUM\abap\exe\R3trans.exe finished (0004).

    R3trans=>sapparam(1c): No Profile used.

    R3trans=>sapparam: SAPSYSTEMNAME neither in Profile nor in Commandline

    This is E:\usr\sap\PRD\SUM\abap\exe\R3trans.exe version 6.23 (release 720 - 27.03.12 - 17:30:00).

    unicode enabled version

    E:\usr\sap\PRD\SUM\abap\exe\R3trans.exe finished (0004).

    R3trans=>sapparam(1c): No Profile used.

    R3trans=>sapparam: SAPSYSTEMNAME neither in Profile nor in Commandline

    This is E:\usr\sap\PRD\SUM\abap\exe\R3trans.exe version 6.23 (release 720 - 27.03.12 - 17:30:00).

    unicode enabled version

    E:\usr\sap\PRD\SUM\abap\exe\R3trans.exe finished (0004).

    R3trans=>sapparam(1c): No Profile used.

    R3trans=>sapparam: SAPSYSTEMNAME neither in Profile nor in Commandline

    This is E:\usr\sap\PRD\SUM\abap\exe\R3trans.exe version 6.23 (release 720 - 27.03.12 - 17:30:00).

    unicode enabled version

    E:\usr\sap\PRD\SUM\abap\exe\R3trans.exe finished (0004).

    R3trans=>sapparam(1c): No Profile used.

    R3trans=>sapparam: SAPSYSTEMNAME neither in Profile nor in Commandline

    This is E:\usr\sap\PRD\SUM\abap\exe\R3trans.exe version 6.23 (release 720 - 27.03.12 - 17:30:00).

    unicode enabled version

    E:\usr\sap\PRD\SUM\abap\exe\R3trans.exe finished (0000).

    R3trans=>sapparam(1c): No Profile used.

    R3trans=>sapparam: SAPSYSTEMNAME neither in Profile nor in Commandline

    This is E:\usr\sap\PRD\SUM\abap\exe\R3trans.exe version 6.23 (release 720 - 27.03.12 - 17:30:00).

    unicode enabled version

    E:\usr\sap\PRD\SUM\abap\exe\R3trans.exe finished (0000).

    R3trans=>sapparam(1c): No Profile used.

    R3trans=>sapparam: SAPSYSTEMNAME neither in Profile nor in Commandline

    This is E:\usr\sap\PRD\SUM\abap\exe\R3trans.exe version 6.23 (release 720 - 27.03.12 - 17:30:00).

    unicode enabled version

    E:\usr\sap\PRD\SUM\abap\exe\R3trans.exe finished (0000).

    R3trans=>sapparam(1c): No Profile used.

    R3trans=>sapparam: SAPSYSTEMNAME neither in Profile nor in Commandline

    This is E:\usr\sap\PRD\SUM\abap\exe\R3trans.exe version 6.23 (release 720 - 27.03.12 - 17:30:00).

    unicode enabled version

    E:\usr\sap\PRD\SUM\abap\exe\R3trans.exe finished (0000).

    R3trans=>sapparam(1c): No Profile used.

    R3trans=>sapparam: SAPSYSTEMNAME neither in Profile nor in Commandline

    This is E:\usr\sap\PRD\SUM\abap\exe\R3trans.exe version 6.23 (release 720 - 27.03.12 - 17:30:00).

    unicode enabled version

    E:\usr\sap\PRD\SUM\abap\exe\R3trans.exe finished (0004).

    R3trans=>sapparam(1c): No Profile used.

    R3trans=>sapparam: SAPSYSTEMNAME neither in Profile nor in Commandline

    This is E:\usr\sap\PRD\SUM\abap\exe\R3trans.exe version 6.23 (release 720 - 27.03.12 - 17:30:00).

    unicode enabled version

    E:\usr\sap\PRD\SUM\abap\exe\R3trans.exe finished (0000).

    R3trans=>sapparam(1c): No Profile used.

    R3trans=>sapparam: SAPSYSTEMNAME neither in Profile nor in Commandline

    This is E:\usr\sap\PRD\SUM\abap\exe\R3trans.exe version 6.23 (release 720 - 27.03.12 - 17:30:00).

    unicode enabled version

    E:\usr\sap\PRD\SUM\abap\exe\R3trans.exe finished (0000).

    R3trans=>sapparam(1c): No Profile used.

    R3trans=>sapparam: SAPSYSTEMNAME neither in Profile nor in Commandline

    This is E:\usr\sap\PRD\SUM\abap\exe\R3trans.exe version 6.23 (release 720 - 27.03.12 - 17:30:00).

    unicode enabled version

    E:\usr\sap\PRD\SUM\abap\exe\R3trans.exe finished (0000).

    R3trans=>sapparam(1c): No Profile used.

    R3trans=>sapparam: SAPSYSTEMNAME neither in Profile nor in Commandline

    This is E:\usr\sap\PRD\SUM\abap\exe\R3trans.exe version 6.23 (release 720 - 27.03.12 - 17:30:00).

    unicode enabled version

    E:\usr\sap\PRD\SUM\abap\exe\R3trans.exe finished (0004).

    R3trans=>sapparam(1c): No Profile used.

    R3trans=>sapparam: SAPSYSTEMNAME neither in Profile nor in Commandline

    This is E:\usr\sap\PRD\SUM\abap\exe\R3trans.exe version 6.23 (release 720 - 27.03.12 - 17:30:00).

    unicode enabled version

    E:\usr\sap\PRD\SUM\abap\exe\R3trans.exe finished (0000).

    R3trans=>sapparam(1c): No Profile used.

    R3trans=>sapparam: SAPSYSTEMNAME neither in Profile nor in Commandline

    This is E:\usr\sap\PRD\SUM\abap\exe\R3trans.exe version 6.23 (release 720 - 27.03.12 - 17:30:00).

    unicode enabled version

    E:\usr\sap\PRD\SUM\abap\exe\R3trans.exe finished (0000).

    R3trans=>sapparam(1c): No Profile used.

    R3trans=>sapparam: SAPSYSTEMNAME neither in Profile nor in Commandline

    This is E:\usr\sap\PRD\SUM\abap\exe\R3trans.exe version 6.23 (release 720 - 27.03.12 - 17:30:00).

    unicode enabled version

    E:\usr\sap\PRD\SUM\abap\exe\R3trans.exe finished (0000).

    R3trans=>sapparam(1c): No Profile used.

    R3trans=>sapparam: SAPSYSTEMNAME neither in Profile nor in Commandline

    This is E:\usr\sap\PRD\SUM\abap\exe\R3trans.exe version 6.23 (release 720 - 27.03.12 - 17:30:00).

    unicode enabled version

    E:\usr\sap\PRD\SUM\abap\exe\R3trans.exe finished (0000).

    R3trans=>sapparam(1c): No Profile used.

    R3trans=>sapparam: SAPSYSTEMNAME neither in Profile nor in Commandline

    This is E:\usr\sap\PRD\SUM\abap\exe\R3trans.exe version 6.23 (release 720 - 27.03.12 - 17:30:00).

    unicode enabled version

    E:\usr\sap\PRD\SUM\abap\exe\R3trans.exe finished (0000).

    R3trans=>sapparam(1c): No Profile used.

    R3trans=>sapparam: SAPSYSTEMNAME neither in Profile nor in Commandline

    This is E:\usr\sap\PRD\SUM\abap\exe\R3trans.exe version 6.23 (release 720 - 27.03.12 - 17:30:00).

    unicode enabled version

    E:\usr\sap\PRD\SUM\abap\exe\R3trans.exe finished (0000).

    R3trans=>sapparam(1c): No Profile used.

    R3trans=>sapparam: SAPSYSTEMNAME neither in Profile nor in Commandline

    This is E:\usr\sap\PRD\SUM\abap\exe\R3trans.exe version 6.23 (release 720 - 27.03.12 - 17:30:00).

    unicode enabled version

    E:\usr\sap\PRD\SUM\abap\exe\R3trans.exe finished (0000).

    R3trans=>sapparam(1c): No Profile used.

    R3trans=>sapparam: SAPSYSTEMNAME neither in Profile nor in Commandline

    This is E:\usr\sap\PRD\SUM\abap\exe\R3trans.exe version 6.23 (release 720 - 27.03.12 - 17:30:00).

    unicode enabled version

    E:\usr\sap\PRD\SUM\abap\exe\R3trans.exe finished (0004).

    R3trans=>sapparam(1c): No Profile used.

    R3trans=>sapparam: SAPSYSTEMNAME neither in Profile nor in Commandline

    This is E:\usr\sap\PRD\SUM\abap\exe\R3trans.exe version 6.23 (release 720 - 27.03.12 - 17:30:00).

    unicode enabled version

    E:\usr\sap\PRD\SUM\abap\exe\R3trans.exe finished (0000).

    R3trans=>sapparam(1c): No Profile used.

    R3trans=>sapparam: SAPSYSTEMNAME neither in Profile nor in Commandline

    This is E:\usr\sap\PRD\SUM\abap\exe\R3trans.exe version 6.23 (release 720 - 27.03.12 - 17:30:00).

    unicode enabled version

    E:\usr\sap\PRD\SUM\abap\exe\R3trans.exe finished (0000).

    R3trans=>sapparam(1c): No Profile used.

    R3trans=>sapparam: SAPSYSTEMNAME neither in Profile nor in Commandline

    This is E:\usr\sap\PRD\SUM\abap\exe\R3trans.exe version 6.23 (release 720 - 27.03.12 - 17:30:00).

    unicode enabled version

    E:\usr\sap\PRD\SUM\abap\exe\R3trans.exe finished (0000).

    R3trans=>sapparam(1c): No Profile used.

    R3trans=>sapparam: SAPSYSTEMNAME neither in Profile nor in Commandline

    This is E:\usr\sap\PRD\SUM\abap\exe\R3trans.exe version 6.23 (release 720 - 27.03.12 - 17:30:00).

    unicode enabled version

    E:\usr\sap\PRD\SUM\abap\exe\R3trans.exe finished (0004).

    R3trans=>sapparam(1c): No Profile used.

    R3trans=>sapparam: SAPSYSTEMNAME neither in Profile nor in Commandline

    This is E:\usr\sap\PRD\SUM\abap\exe\R3trans.exe version 6.23 (release 720 - 27.03.12 - 17:30:00).

    unicode enabled version

    E:\usr\sap\PRD\SUM\abap\exe\R3trans.exe finished (0000).

    R3trans=>sapparam(1c): No Profile used.

    R3trans=>sapparam: SAPSYSTEMNAME neither in Profile nor in Commandline

    This is E:\usr\sap\PRD\SUM\abap\exe\R3trans.exe version 6.23 (release 720 - 27.03.12 - 17:30:00).

    unicode enabled version

    E:\usr\sap\PRD\SUM\abap\exe\R3trans.exe finished (0000).

    R3trans=>sapparam(1c): No Profile used.

    R3trans=>sapparam: SAPSYSTEMNAME neither in Profile nor in Commandline

    This is E:\usr\sap\PRD\SUM\abap\exe\R3trans.exe version 6.23 (release 720 - 27.03.12 - 17:30:00).

    unicode enabled version

    E:\usr\sap\PRD\SUM\abap\exe\R3trans.exe finished (0000).

    R3trans=>sapparam(1c): No Profile used.

    R3trans=>sapparam: SAPSYSTEMNAME neither in Profile nor in Commandline

    This is E:\usr\sap\PRD\SUM\abap\exe\R3trans.exe version 6.23 (release 720 - 27.03.12 - 17:30:00).

    unicode enabled version

    E:\usr\sap\PRD\SUM\abap\exe\R3trans.exe finished (0000).

    R3trans=>sapparam(1c): No Profile used.

    R3trans=>sapparam: SAPSYSTEMNAME neither in Profile nor in Commandline

    This is E:\usr\sap\PRD\SUM\abap\exe\R3trans.exe version 6.23 (release 720 - 27.03.12 - 17:30:00).

    unicode enabled version

    E:\usr\sap\PRD\SUM\abap\exe\R3trans.exe finished (0004).

    R3trans=>sapparam(1c): No Profile used.

    R3trans=>sapparam: SAPSYSTEMNAME neither in Profile nor in Commandline

    This is E:\usr\sap\PRD\SUM\abap\exe\R3trans.exe version 6.23 (release 720 - 27.03.12 - 17:30:00).

    unicode enabled version

    E:\usr\sap\PRD\SUM\abap\exe\R3trans.exe finished (0004).

    R3trans=>sapparam(1c): No Profile used.

    R3trans=>sapparam: SAPSYSTEMNAME neither in Profile nor in Commandline

    This is E:\usr\sap\PRD\SUM\abap\exe\R3trans.exe version 6.23 (release 720 - 27.03.12 - 17:30:00).

    unicode enabled version

    E:\usr\sap\PRD\SUM\abap\exe\R3trans.exe finished (0004).

    R3trans=>sapparam(1c): No Profile used.

    R3trans=>sapparam: SAPSYSTEMNAME neither in Profile nor in Commandline

    This is E:\usr\sap\PRD\SUM\abap\exe\R3trans.exe version 6.23 (release 720 - 27.03.12 - 17:30:00).

    unicode enabled version

    E:\usr\sap\PRD\SUM\abap\exe\R3trans.exe finished (0004).

    R3trans=>sapparam(1c): No Profile used.

    R3trans=>sapparam: SAPSYSTEMNAME neither in Profile nor in Commandline

    This is E:\usr\sap\PRD\SUM\abap\exe\R3trans.exe version 6.23 (release 720 - 27.03.12 - 17:30:00).

    unicode enabled version

    E:\usr\sap\PRD\SUM\abap\exe\R3trans.exe finished (0000).

    R3trans=>sapparam(1c): No Profile used.

    R3trans=>sapparam: SAPSYSTEMNAME neither in Profile nor in Commandline

    This is E:\usr\sap\PRD\SUM\abap\exe\R3trans.exe version 6.23 (release 720 - 27.03.12 - 17:30:00).

    unicode enabled version

    E:\usr\sap\PRD\SUM\abap\exe\R3trans.exe finished (0000).

    R3trans=>sapparam(1c): No Profile used.

    R3trans=>sapparam: SAPSYSTEMNAME neither in Profile nor in Commandline

    This is E:\usr\sap\PRD\SUM\abap\exe\R3trans.exe version 6.23 (release 720 - 27.03.12 - 17:30:00).

    unicode enabled version

    E:\usr\sap\PRD\SUM\abap\exe\R3trans.exe finished (0000).

    R3trans=>sapparam(1c): No Profile used.

    R3trans=>sapparam: SAPSYSTEMNAME neither in Profile nor in Commandline

    This is E:\usr\sap\PRD\SUM\abap\exe\R3trans.exe version 6.23 (release 720 - 27.03.12 - 17:30:00).

    unicode enabled version

    E:\usr\sap\PRD\SUM\abap\exe\R3trans.exe finished (0000).

    R3trans=>sapparam(1c): No Profile used.

    R3trans=>sapparam: SAPSYSTEMNAME neither in Profile nor in Commandline

    This is E:\usr\sap\PRD\SUM\abap\exe\R3trans.exe version 6.23 (release 720 - 27.03.12 - 17:30:00).

    unicode enabled version

    E:\usr\sap\PRD\SUM\abap\exe\R3trans.exe finished (0000).

    R3trans=>sapparam(1c): No Profile used.

    R3trans=>sapparam: SAPSYSTEMNAME neither in Profile nor in Commandline

    This is E:\usr\sap\PRD\SUM\abap\exe\R3trans.exe version 6.23 (release 720 - 27.03.12 - 17:30:00).

    unicode enabled version

    E:\usr\sap\PRD\SUM\abap\exe\R3trans.exe finished (0000).

    R3trans=>sapparam(1c): No Profile used.

    R3trans=>sapparam: SAPSYSTEMNAME neither in Profile nor in Commandline

    This is E:\usr\sap\PRD\SUM\abap\exe\R3trans.exe version 6.23 (release 720 - 27.03.12 - 17:30:00).

    unicode enabled version

    E:\usr\sap\PRD\SUM\abap\exe\R3trans.exe finished (0000).

    R3trans=>sapparam(1c): No Profile used.

    R3trans=>sapparam: SAPSYSTEMNAME neither in Profile nor in Commandline

    This is E:\usr\sap\PRD\SUM\abap\exe\R3trans.exe version 6.23 (release 720 - 27.03.12 - 17:30:00).

    unicode enabled version

    E:\usr\sap\PRD\SUM\abap\exe\R3trans.exe finished (0000).

    R3trans=>sapparam(1c): No Profile used.

    R3trans=>sapparam: SAPSYSTEMNAME neither in Profile nor in Commandline

    This is E:\usr\sap\PRD\SUM\abap\exe\R3trans.exe version 6.23 (release 720 - 27.03.12 - 17:30:00).

    unicode enabled version

    E:\usr\sap\PRD\SUM\abap\exe\R3trans.exe finished (0000).

    R3trans=>sapparam(1c): No Profile used.

    R3trans=>sapparam: SAPSYSTEMNAME neither in Profile nor in Commandline

    This is E:\usr\sap\PRD\SUM\abap\exe\R3trans.exe version 6.23 (release 720 - 27.03.12 - 17:30:00).

    unicode enabled version

    E:\usr\sap\PRD\SUM\abap\exe\R3trans.exe finished (0000).

    R3trans=>sapparam(1c): No Profile used.

    R3trans=>sapparam: SAPSYSTEMNAME neither in Profile nor in Commandline

    This is E:\usr\sap\PRD\SUM\abap\exe\R3trans.exe version 6.23 (release 720 - 27.03.12 - 17:30:00).

    unicode enabled version

    E:\usr\sap\PRD\SUM\abap\exe\R3trans.exe finished (0000).

    R3trans=>sapparam(1c): No Profile used.

    R3trans=>sapparam: SAPSYSTEMNAME neither in Profile nor in Commandline

    This is E:\usr\sap\PRD\SUM\abap\exe\R3trans.exe version 6.23 (release 720 - 27.03.12 - 17:30:00).

    unicode enabled version

    E:\usr\sap\PRD\SUM\abap\exe\R3trans.exe finished (0000).

    R3trans=>sapparam(1c): No Profile used.

    R3trans=>sapparam: SAPSYSTEMNAME neither in Profile nor in Commandline

    This is E:\usr\sap\PRD\SUM\abap\exe\R3trans.exe version 6.23 (release 720 - 27.03.12 - 17:30:00).

    unicode enabled version

    E:\usr\sap\PRD\SUM\abap\exe\R3trans.exe finished (0000).

    R3trans=>sapparam(1c): No Profile used.

    R3trans=>sapparam: SAPSYSTEMNAME neither in Profile nor in Commandline

    This is E:\usr\sap\PRD\SUM\abap\exe\R3trans.exe version 6.23 (release 720 - 27.03.12 - 17:30:00).

    unicode enabled version

    E:\usr\sap\PRD\SUM\abap\exe\R3trans.exe finished (0000).

    R3trans=>sapparam(1c): No Profile used.

    R3trans=>sapparam: SAPSYSTEMNAME neither in Profile nor in Commandline

    This is E:\usr\sap\PRD\SUM\abap\exe\R3trans.exe version 6.23 (release 720 - 27.03.12 - 17:30:00).

    unicode enabled version

    E:\usr\sap\PRD\SUM\abap\exe\R3trans.exe finished (0000).

    R3trans=>sapparam(1c): No Profile used.

    R3trans=>sapparam: SAPSYSTEMNAME neither in Profile nor in Commandline

    This is E:\usr\sap\PRD\SUM\abap\exe\R3trans.exe version 6.23 (release 720 - 27.03.12 - 17:30:00).

    unicode enabled version

    E:\usr\sap\PRD\SUM\abap\exe\R3trans.exe finished (0000).

    R3trans=>sapparam(1c): No Profile used.

    R3trans=>sapparam: SAPSYSTEMNAME neither in Profile nor in Commandline

    This is E:\usr\sap\PRD\SUM\abap\exe\R3trans.exe version 6.23 (release 720 - 27.03.12 - 17:30:00).

    unicode enabled version

    E:\usr\sap\PRD\SUM\abap\exe\R3trans.exe finished (0000).

    R3trans=>sapparam(1c): No Profile used.

    R3trans=>sapparam: SAPSYSTEMNAME neither in Profile nor in Commandline

    This is E:\usr\sap\PRD\SUM\abap\exe\R3trans.exe version 6.23 (release 720 - 27.03.12 - 17:30:00).

    unicode enabled version

    E:\usr\sap\PRD\SUM\abap\exe\R3trans.exe finished (0000).

    R3trans=>sapparam(1c): No Profile used.

    R3trans=>sapparam: SAPSYSTEMNAME neither in Profile nor in Commandline

    This is E:\usr\sap\PRD\SUM\abap\exe\R3trans.exe version 6.23 (release 720 - 27.03.12 - 17:30:00).

    unicode enabled version

    E:\usr\sap\PRD\SUM\abap\exe\R3trans.exe finished (0004).

    R3trans=>sapparam(1c): No Profile used.

    R3trans=>sapparam: SAPSYSTEMNAME neither in Profile nor in Commandline

    This is E:\usr\sap\PRD\SUM\abap\exe\R3trans.exe version 6.23 (release 720 - 27.03.12 - 17:30:00).

    unicode enabled version

    E:\usr\sap\PRD\SUM\abap\exe\R3trans.exe finished (0000).

    R3trans=>sapparam(1c): No Profile used.

    R3trans=>sapparam: SAPSYSTEMNAME neither in Profile nor in Commandline

    This is E:\usr\sap\PRD\SUM\abap\exe\R3trans.exe version 6.23 (release 720 - 27.03.12 - 17:30:00).

    unicode enabled version

    E:\usr\sap\PRD\SUM\abap\exe\R3trans.exe finished (0000).

    R3trans=>sapparam(1c): No Profile used.

    R3trans=>sapparam: SAPSYSTEMNAME neither in Profile nor in Commandline

    This is E:\usr\sap\PRD\SUM\abap\exe\R3trans.exe version 6.23 (release 720 - 27.03.12 - 17:30:00).

    unicode enabled version

    E:\usr\sap\PRD\SUM\abap\exe\R3trans.exe finished (0004).

    R3trans=>sapparam(1c): No Profile used.

    R3trans=>sapparam: SAPSYSTEMNAME neither in Profile nor in Commandline

    This is E:\usr\sap\PRD\SUM\abap\exe\R3trans.exe version 6.23 (release 720 - 27.03.12 - 17:30:00).

    unicode enabled version

    E:\usr\sap\PRD\SUM\abap\exe\R3trans.exe finished (0004).

    R3trans=>sapparam(1c): No Profile used.

    R3trans=>sapparam: SAPSYSTEMNAME neither in Profile nor in Commandline

    This is E:\usr\sap\PRD\SUM\abap\exe\R3trans.exe version 6.23 (release 720 - 27.03.12 - 17:30:00).

    unicode enabled version

    E:\usr\sap\PRD\SUM\abap\exe\R3trans.exe finished (0004).

    R3trans=>sapparam(1c): No Profile used.

    R3trans=>sapparam: SAPSYSTEMNAME neither in Profile nor in Commandline

    This is E:\usr\sap\PRD\SUM\abap\exe\R3trans.exe version 6.23 (release 720 - 27.03.12 - 17:30:00).

    unicode enabled version

    E:\usr\sap\PRD\SUM\abap\exe\R3trans.exe finished (0004).

    R3trans=>sapparam(1c): No Profile used.

    R3trans=>sapparam: SAPSYSTEMNAME neither in Profile nor in Commandline

    This is E:\usr\sap\PRD\SUM\abap\exe\R3trans.exe version 6.23 (release 720 - 27.03.12 - 17:30:00).

    unicode enabled version

    E:\usr\sap\PRD\SUM\abap\exe\R3trans.exe finished (0000).

    R3trans=>sapparam(1c): No Profile used.

    R3trans=>sapparam: SAPSYSTEMNAME neither in Profile nor in Commandline

    This is E:\usr\sap\PRD\SUM\abap\exe\R3trans.exe version 6.23 (release 720 - 27.03.12 - 17:30:00).

    unicode enabled version

    E:\usr\sap\PRD\SUM\abap\exe\R3trans.exe finished (0004).

    R3trans=>sapparam(1c): No Profile used.

    R3trans=>sapparam: SAPSYSTEMNAME neither in Profile nor in Commandline

    This is E:\usr\sap\PRD\SUM\abap\exe\R3trans.exe version 6.23 (release 720 - 27.03.12 - 17:30:00).

    unicode enabled version

    E:\usr\sap\PRD\SUM\abap\exe\R3trans.exe finished (0000).

    R3trans=>sapparam(1c): No Profile used.

    R3trans=>sapparam: SAPSYSTEMNAME neither in Profile nor in Commandline

    This is E:\usr\sap\PRD\SUM\abap\exe\R3trans.exe version 6.23 (release 720 - 27.03.12 - 17:30:00).

    unicode enabled version

    E:\usr\sap\PRD\SUM\abap\exe\R3trans.exe finished (0004).

    R3trans=>sapparam(1c): No Profile used.

    R3trans=>sapparam: SAPSYSTEMNAME neither in Profile nor in Commandline

    This is E:\usr\sap\PRD\SUM\abap\exe\R3trans.exe version 6.23 (release 720 - 27.03.12 - 17:30:00).

    unicode enabled version

    E:\usr\sap\PRD\SUM\abap\exe\R3trans.exe finished (0004).

    R3trans=>sapparam(1c): No Profile used.

    R3trans=>sapparam: SAPSYSTEMNAME neither in Profile nor in Commandline

    This is E:\usr\sap\PRD\SUM\abap\exe\R3trans.exe version 6.23 (release 720 - 27.03.12 - 17:30:00).

    unicode enabled version

    E:\usr\sap\PRD\SUM\abap\exe\R3trans.exe finished (0004).

    R3trans=>sapparam(1c): No Profile used.

    R3trans=>sapparam: SAPSYSTEMNAME neither in Profile nor in Commandline

    This is E:\usr\sap\PRD\SUM\abap\exe\R3trans.exe version 6.23 (release 720 - 27.03.12 - 17:30:00).

    unicode enabled version

    E:\usr\sap\PRD\SUM\abap\exe\R3trans.exe finished (0004).

    R3trans=>sapparam(1c): No Profile used.

    R3trans=>sapparam: SAPSYSTEMNAME neither in Profile nor in Commandline

    This is E:\usr\sap\PRD\SUM\abap\exe\R3trans.exe version 6.23 (release 720 - 27.03.12 - 17:30:00).

    unicode enabled version

    E:\usr\sap\PRD\SUM\abap\exe\R3trans.exe finished (0004).

    R3trans=>sapparam(1c): No Profile used.

    R3trans=>sapparam: SAPSYSTEMNAME neither in Profile nor in Commandline

    This is E:\usr\sap\PRD\SUM\abap\exe\R3trans.exe version 6.23 (release 720 - 27.03.12 - 17:30:00).

    unicode enabled version

    E:\usr\sap\PRD\SUM\abap\exe\R3trans.exe finished (0004).

    R3trans=>sapparam(1c): No Profile used.

    R3trans=>sapparam: SAPSYSTEMNAME neither in Profile nor in Commandline

    This is E:\usr\sap\PRD\SUM\abap\exe\R3trans.exe version 6.23 (release 720 - 27.03.12 - 17:30:00).

    unicode enabled version

    E:\usr\sap\PRD\SUM\abap\exe\R3trans.exe finished (0004).

    R3trans=>sapparam(1c): No Profile used.

    R3trans=>sapparam: SAPSYSTEMNAME neither in Profile nor in Commandline

    This is E:\usr\sap\PRD\SUM\abap\exe\R3trans.exe version 6.23 (release 720 - 27.03.12 - 17:30:00).

    unicode enabled version

    E:\usr\sap\PRD\SUM\abap\exe\R3trans.exe finished (0004).

    R3trans=>sapparam(1c): No Profile used.

    R3trans=>sapparam: SAPSYSTEMNAME neither in Profile nor in Commandline

    This is E:\usr\sap\PRD\SUM\abap\exe\R3trans.exe version 6.23 (release 720 - 27.03.12 - 17:30:00).

    unicode enabled version

    E:\usr\sap\PRD\SUM\abap\exe\R3trans.exe finished (0004).

    R3trans=>sapparam(1c): No Profile used.

    R3trans=>sapparam: SAPSYSTEMNAME neither in Profile nor in Commandline

    This is E:\usr\sap\PRD\SUM\abap\exe\R3trans.exe version 6.23 (release 720 - 27.03.12 - 17:30:00).

    unicode enabled version

    E:\usr\sap\PRD\SUM\abap\exe\R3trans.exe finished (0004).

    R3trans=>sapparam(1c): No Profile used.

    R3trans=>sapparam: SAPSYSTEMNAME neither in Profile nor in Commandline

    This is E:\usr\sap\PRD\SUM\abap\exe\R3trans.exe version 6.23 (release 720 - 27.03.12 - 17:30:00).

    unicode enabled version

    E:\usr\sap\PRD\SUM\abap\exe\R3trans.exe finished (0004).

    R3trans=>sapparam(1c): No Profile used.

    R3trans=>sapparam: SAPSYSTEMNAME neither in Profile nor in Commandline

    This is E:\usr\sap\PRD\SUM\abap\exe\R3trans.exe version 6.23 (release 720 - 27.03.12 - 17:30:00).

    unicode enabled version

    E:\usr\sap\PRD\SUM\abap\exe\R3trans.exe finished (0004).

    R3trans=>sapparam(1c): No Profile used.

    R3trans=>sapparam: SAPSYSTEMNAME neither in Profile nor in Commandline

    This is E:\usr\sap\PRD\SUM\abap\exe\R3trans.exe version 6.23 (release 720 - 27.03.12 - 17:30:00).

    unicode enabled version

    E:\usr\sap\PRD\SUM\abap\exe\R3trans.exe finished (0004).

    R3trans=>sapparam(1c): No Profile used.

    R3trans=>sapparam: SAPSYSTEMNAME neither in Profile nor in Commandline

    This is E:\usr\sap\PRD\SUM\abap\exe\R3trans.exe version 6.23 (release 720 - 27.03.12 - 17:30:00).

    unicode enabled version

    E:\usr\sap\PRD\SUM\abap\exe\R3trans.exe finished (0004).

    R3trans=>sapparam(1c): No Profile used.

    R3trans=>sapparam: SAPSYSTEMNAME neither in Profile nor in Commandline

    This is E:\usr\sap\PRD\SUM\abap\exe\R3trans.exe version 6.23 (release 720 - 27.03.12 - 17:30:00).

    unicode enabled version

    E:\usr\sap\PRD\SUM\abap\exe\R3trans.exe finished (0004).

    R3trans=>sapparam(1c): No Profile used.

    R3trans=>sapparam: SAPSYSTEMNAME neither in Profile nor in Commandline

    This is E:\usr\sap\PRD\SUM\abap\exe\R3trans.exe version 6.23 (release 720 - 27.03.12 - 17:30:00).

    unicode enabled version

    E:\usr\sap\PRD\SUM\abap\exe\R3trans.exe finished (0004).

    R3trans=>sapparam(1c): No Profile used.

    R3trans=>sapparam: SAPSYSTEMNAME neither in Profile nor in Commandline

    This is E:\usr\sap\PRD\SUM\abap\exe\R3trans.exe version 6.23 (release 720 - 27.03.12 - 17:30:00).

    unicode enabled version

    E:\usr\sap\PRD\SUM\abap\exe\R3trans.exe finished (0004).

    R3trans=>sapparam(1c): No Profile used.

    R3trans=>sapparam: SAPSYSTEMNAME neither in Profile nor in Commandline

    This is E:\usr\sap\PRD\SUM\abap\exe\R3trans.exe version 6.23 (release 720 - 27.03.12 - 17:30:00).

    unicode enabled version

    E:\usr\sap\PRD\SUM\abap\exe\R3trans.exe finished (0004).

    R3trans=>sapparam(1c): No Profile used.

    R3trans=>sapparam: SAPSYSTEMNAME neither in Profile nor in Commandline

    This is E:\usr\sap\PRD\SUM\abap\exe\R3trans.exe version 6.23 (release 720 - 27.03.12 - 17:30:00).

    unicode enabled version

    E:\usr\sap\PRD\SUM\abap\exe\R3trans.exe finished (0004).

    R3trans=>sapparam(1c): No Profile used.

    R3trans=>sapparam: SAPSYSTEMNAME neither in Profile nor in Commandline

    This is E:\usr\sap\PRD\SUM\abap\exe\R3trans.exe version 6.23 (release 720 - 27.03.12 - 17:30:00).

    unicode enabled version

    E:\usr\sap\PRD\SUM\abap\exe\R3trans.exe finished (0004).

    R3trans=>sapparam(1c): No Profile used.

    R3trans=>sapparam: SAPSYSTEMNAME neither in Profile nor in Commandline

    This is E:\usr\sap\PRD\SUM\abap\exe\R3trans.exe version 6.23 (release 720 - 27.03.12 - 17:30:00).

    unicode enabled version

    E:\usr\sap\PRD\SUM\abap\exe\R3trans.exe finished (0004).

    R3trans=>sapparam(1c): No Profile used.

    R3trans=>sapparam: SAPSYSTEMNAME neither in Profile nor in Commandline

    This is E:\usr\sap\PRD\SUM\abap\exe\R3trans.exe version 6.23 (release 720 - 27.03.12 - 17:30:00).

    unicode enabled version

    E:\usr\sap\PRD\SUM\abap\exe\R3trans.exe finished (0004).

    R3trans=>sapparam(1c): No Profile used.

    R3trans=>sapparam: SAPSYSTEMNAME neither in Profile nor in Commandline

    This is E:\usr\sap\PRD\SUM\abap\exe\R3trans.exe version 6.23 (release 720 - 27.03.12 - 17:30:00).

    unicode enabled version

    E:\usr\sap\PRD\SUM\abap\exe\R3trans.exe finished (0004).

    R3trans=>sapparam(1c): No Profile used.

    R3trans=>sapparam: SAPSYSTEMNAME neither in Profile nor in Commandline

    This is E:\usr\sap\PRD\SUM\abap\exe\R3trans.exe version 6.23 (release 720 - 27.03.12 - 17:30:00).

    unicode enabled version

    E:\usr\sap\PRD\SUM\abap\exe\R3trans.exe finished (0004).

    R3trans=>sapparam(1c): No Profile used.

    R3trans=>sapparam: SAPSYSTEMNAME neither in Profile nor in Commandline

    This is E:\usr\sap\PRD\SUM\abap\exe\R3trans.exe version 6.23 (release 720 - 27.03.12 - 17:30:00).

    unicode enabled version

    E:\usr\sap\PRD\SUM\abap\exe\R3trans.exe finished (0000).

    R3trans=>sapparam(1c): No Profile used.

    R3trans=>sapparam: SAPSYSTEMNAME neither in Profile nor in Commandline

    This is E:\usr\sap\PRD\SUM\abap\exe\R3trans.exe version 6.23 (release 720 - 27.03.12 - 17:30:00).

    unicode enabled version

    E:\usr\sap\PRD\SUM\abap\exe\R3trans.exe finished (0004).

    R3trans=>sapparam(1c): No Profile used.

    R3trans=>sapparam: SAPSYSTEMNAME neither in Profile nor in Commandline

    This is E:\usr\sap\PRD\SUM\abap\exe\R3trans.exe version 6.23 (release 720 - 27.03.12 - 17:30:00).

    unicode enabled version

    E:\usr\sap\PRD\SUM\abap\exe\R3trans.exe finished (0004).

    R3trans=>sapparam(1c): No Profile used.

    R3trans=>sapparam: SAPSYSTEMNAME neither in Profile nor in Commandline

    This is E:\usr\sap\PRD\SUM\abap\exe\R3trans.exe version 6.23 (release 720 - 27.03.12 - 17:30:00).

    unicode enabled version

    E:\usr\sap\PRD\SUM\abap\exe\R3trans.exe finished (0004).

    R3trans=>sapparam(1c): No Profile used.

    R3trans=>sapparam: SAPSYSTEMNAME neither in Profile nor in Commandline

    This is E:\usr\sap\PRD\SUM\abap\exe\R3trans.exe version 6.23 (release 720 - 27.03.12 - 17:30:00).

    unicode enabled version

    E:\usr\sap\PRD\SUM\abap\exe\R3trans.exe finished (0004).

    R3trans=>sapparam(1c): No Profile used.

    R3trans=>sapparam: SAPSYSTEMNAME neither in Profile nor in Commandline

    This is E:\usr\sap\PRD\SUM\abap\exe\R3trans.exe version 6.23 (release 720 - 27.03.12 - 17:30:00).

    unicode enabled version

    E:\usr\sap\PRD\SUM\abap\exe\R3trans.exe finished (0004).

    R3trans=>sapparam(1c): No Profile used.

    R3trans=>sapparam: SAPSYSTEMNAME neither in Profile nor in Commandline

    This is E:\usr\sap\PRD\SUM\abap\exe\R3trans.exe version 6.23 (release 720 - 27.03.12 - 17:30:00).

    unicode enabled version

    E:\usr\sap\PRD\SUM\abap\exe\R3trans.exe finished (0004).

    R3trans=>sapparam(1c): No Profile used.

    R3trans=>sapparam: SAPSYSTEMNAME neither in Profile nor in Commandline

    This is E:\usr\sap\PRD\SUM\abap\exe\R3trans.exe version 6.23 (release 720 - 27.03.12 - 17:30:00).

    unicode enabled version

    E:\usr\sap\PRD\SUM\abap\exe\R3trans.exe finished (0004).

    R3trans=>sapparam(1c): No Profile used.

    R3trans=>sapparam: SAPSYSTEMNAME neither in Profile nor in Commandline

    This is E:\usr\sap\PRD\SUM\abap\exe\R3trans.exe version 6.23 (release 720 - 27.03.12 - 17:30:00).

    unicode enabled version

    E:\usr\sap\PRD\SUM\abap\exe\R3trans.exe finished (0004).

    R3trans=>sapparam(1c): No Profile used.

    R3trans=>sapparam: SAPSYSTEMNAME neither in Profile nor in Commandline

    This is E:\usr\sap\PRD\SUM\abap\exe\R3trans.exe version 6.23 (release 720 - 27.03.12 - 17:30:00).

    unicode enabled version

    E:\usr\sap\PRD\SUM\abap\exe\R3trans.exe finished (0004).

    R3trans=>sapparam(1c): No Profile used.

    R3trans=>sapparam: SAPSYSTEMNAME neither in Profile nor in Commandline

    This is E:\usr\sap\PRD\SUM\abap\exe\R3trans.exe version 6.23 (release 720 - 27.03.12 - 17:30:00).

    unicode enabled version

    E:\usr\sap\PRD\SUM\abap\exe\R3trans.exe finished (0004).

    R3trans=>sapparam(1c): No Profile used.

    R3trans=>sapparam: SAPSYSTEMNAME neither in Profile nor in Commandline

    This is E:\usr\sap\PRD\SUM\abap\exe\R3trans.exe version 6.23 (release 720 - 27.03.12 - 17:30:00).

    unicode enabled version

    E:\usr\sap\PRD\SUM\abap\exe\R3trans.exe finished (0004).

    R3trans=>sapparam(1c): No Profile used.

    R3trans=>sapparam: SAPSYSTEMNAME neither in Profile nor in Commandline

    This is E:\usr\sap\PRD\SUM\abap\exe\R3trans.exe version 6.23 (release 720 - 27.03.12 - 17:30:00).

    unicode enabled version

    E:\usr\sap\PRD\SUM\abap\exe\R3trans.exe finished (0004).

    R3trans=>sapparam(1c): No Profile used.

    R3trans=>sapparam: SAPSYSTEMNAME neither in Profile nor in Commandline

    This is E:\usr\sap\PRD\SUM\abap\exe\R3trans.exe version 6.23 (release 720 - 27.03.12 - 17:30:00).

    unicode enabled version

    E:\usr\sap\PRD\SUM\abap\exe\R3trans.exe finished (0004).

    R3trans=>sapparam(1c): No Profile used.

    R3trans=>sapparam: SAPSYSTEMNAME neither in Profile nor in Commandline

    This is E:\usr\sap\PRD\SUM\abap\exe\R3trans.exe version 6.23 (release 720 - 27.03.12 - 17:30:00).

    unicode enabled version

    E:\usr\sap\PRD\SUM\abap\exe\R3trans.exe finished (0004).

    R3trans=>sapparam(1c): No Profile used.

    R3trans=>sapparam: SAPSYSTEMNAME neither in Profile nor in Commandline

    This is E:\usr\sap\PRD\SUM\abap\exe\R3trans.exe version 6.23 (release 720 - 27.03.12 - 17:30:00).

    unicode enabled version

    E:\usr\sap\PRD\SUM\abap\exe\R3trans.exe finished (0004).

    R3trans=>sapparam(1c): No Profile used.

    R3trans=>sapparam: SAPSYSTEMNAME neither in Profile nor in Commandline

    This is E:\usr\sap\PRD\SUM\abap\exe\R3trans.exe version 6.23 (release 720 - 27.03.12 - 17:30:00).

    unicode enabled version

    E:\usr\sap\PRD\SUM\abap\exe\R3trans.exe finished (0004).

    R3trans=>sapparam(1c): No Profile used.

    R3trans=>sapparam: SAPSYSTEMNAME neither in Profile nor in Commandline

    This is E:\usr\sap\PRD\SUM\abap\exe\R3trans.exe version 6.23 (release 720 - 27.03.12 - 17:30:00).

    unicode enabled version

    E:\usr\sap\PRD\SUM\abap\exe\R3trans.exe finished (0004).

    R3trans=>sapparam(1c): No Profile used.

    R3trans=>sapparam: SAPSYSTEMNAME neither in Profile nor in Commandline

    This is E:\usr\sap\PRD\SUM\abap\exe\R3trans.exe version 6.23 (release 720 - 27.03.12 - 17:30:00).

    unicode enabled version

    E:\usr\sap\PRD\SUM\abap\exe\R3trans.exe finished (0004).

    R3trans=>sapparam(1c): No Profile used.

    R3trans=>sapparam: SAPSYSTEMNAME neither in Profile nor in Commandline

    This is E:\usr\sap\PRD\SUM\abap\exe\R3trans.exe version 6.23 (release 720 - 27.03.12 - 17:30:00).

    unicode enabled version

    E:\usr\sap\PRD\SUM\abap\exe\R3trans.exe finished (0004).

    R3trans=>sapparam(1c): No Profile used.

    R3trans=>sapparam: SAPSYSTEMNAME neither in Profile nor in Commandline

    This is E:\usr\sap\PRD\SUM\abap\exe\R3trans.exe version 6.23 (release 720 - 27.03.12 - 17:30:00).

    unicode enabled version

    E:\usr\sap\PRD\SUM\abap\exe\R3trans.exe finished (0004).

    R3trans=>sapparam(1c): No Profile used.

    R3trans=>sapparam: SAPSYSTEMNAME neither in Profile nor in Commandline

    This is E:\usr\sap\PRD\SUM\abap\exe\R3trans.exe version 6.23 (release 720 - 27.03.12 - 17:30:00).

    unicode enabled version

    E:\usr\sap\PRD\SUM\abap\exe\R3trans.exe finished (0000).

    R3trans=>sapparam(1c): No Profile used.

    R3trans=>sapparam: SAPSYSTEMNAME neither in Profile nor in Commandline

    This is E:\usr\sap\PRD\SUM\abap\exe\R3trans.exe version 6.23 (release 720 - 27.03.12 - 17:30:00).

    unicode enabled version

    E:\usr\sap\PRD\SUM\abap\exe\R3trans.exe finished (0004).

    R3trans=>sapparam(1c): No Profile used.

    R3trans=>sapparam: SAPSYSTEMNAME neither in Profile nor in Commandline

    This is E:\usr\sap\PRD\SUM\abap\exe\R3trans.exe version 6.23 (release 720 - 27.03.12 - 17:30:00).

    unicode enabled version

    E:\usr\sap\PRD\SUM\abap\exe\R3trans.exe finished (0004).

    R3trans=>sapparam(1c): No Profile used.

    R3trans=>sapparam: SAPSYSTEMNAME neither in Profile nor in Commandline

    This is E:\usr\sap\PRD\SUM\abap\exe\R3trans.exe version 6.23 (release 720 - 27.03.12 - 17:30:00).

    unicode enabled version

    E:\usr\sap\PRD\SUM\abap\exe\R3trans.exe finished (0004).

    R3trans=>sapparam(1c): No Profile used.

    R3trans=>sapparam: SAPSYSTEMNAME neither in Profile nor in Commandline

    This is E:\usr\sap\PRD\SUM\abap\exe\R3trans.exe version 6.23 (release 720 - 27.03.12 - 17:30:00).

    unicode enabled version

    E:\usr\sap\PRD\SUM\abap\exe\R3trans.exe finished (0004).

    R3trans=>sapparam(1c): No Profile used.

    R3trans=>sapparam: SAPSYSTEMNAME neither in Profile nor in Commandline

    This is E:\usr\sap\PRD\SUM\abap\exe\R3trans.exe version 6.23 (release 720 - 27.03.12 - 17:30:00).

    unicode enabled version

    E:\usr\sap\PRD\SUM\abap\exe\R3trans.exe finished (0004).

    R3trans=>sapparam(1c): No Profile used.

    R3trans=>sapparam: SAPSYSTEMNAME neither in Profile nor in Commandline

    This is E:\usr\sap\PRD\SUM\abap\exe\R3trans.exe version 6.23 (release 720 - 27.03.12 - 17:30:00).

    unicode enabled version

    E:\usr\sap\PRD\SUM\abap\exe\R3trans.exe finished (0004).

    R3trans=>sapparam(1c): No Profile used.

    R3trans=>sapparam: SAPSYSTEMNAME neither in Profile nor in Commandline

    This is E:\usr\sap\PRD\SUM\abap\exe\R3trans.exe version 6.23 (release 720 - 27.03.12 - 17:30:00).

    unicode enabled version

    E:\usr\sap\PRD\SUM\abap\exe\R3trans.exe finished (0000).

    R3trans=>sapparam(1c): No Profile used.

    R3trans=>sapparam: SAPSYSTEMNAME neither in Profile nor in Commandline

    This is E:\usr\sap\PRD\SUM\abap\exe\R3trans.exe version 6.23 (release 720 - 27.03.12 - 17:30:00).

    unicode enabled version

    E:\usr\sap\PRD\SUM\abap\exe\R3trans.exe finished (0000).

    R3trans=>sapparam(1c): No Profile used.

    R3trans=>sapparam: SAPSYSTEMNAME neither in Profile nor in Commandline

    This is E:\usr\sap\PRD\SUM\abap\exe\R3trans.exe version 6.23 (release 720 - 27.03.12 - 17:30:00).

    unicode enabled version

    E:\usr\sap\PRD\SUM\abap\exe\R3trans.exe finished (0000).

    R3trans=>sapparam(1c): No Profile used.

    R3trans=>sapparam: SAPSYSTEMNAME neither in Profile nor in Commandline

    This is E:\usr\sap\PRD\SUM\abap\exe\R3trans.exe version 6.23 (release 720 - 27.03.12 - 17:30:00).

    unicode enabled version

    E:\usr\sap\PRD\SUM\abap\exe\R3trans.exe finished (0000).

    R3trans=>sapparam(1c): No Profile used.

    R3trans=>sapparam: SAPSYSTEMNAME neither in Profile nor in Commandline

    This is E:\usr\sap\PRD\SUM\abap\exe\R3trans.exe version 6.23 (release 720 - 27.03.12 - 17:30:00).

    unicode enabled version

    E:\usr\sap\PRD\SUM\abap\exe\R3trans.exe finished (0004).

    R3trans=>sapparam(1c): No Profile used.

    R3trans=>sapparam: SAPSYSTEMNAME neither in Profile nor in Commandline

    This is E:\usr\sap\PRD\SUM\abap\exe\R3trans.exe version 6.23 (release 720 - 27.03.12 - 17:30:00).

    unicode enabled version

    E:\usr\sap\PRD\SUM\abap\exe\R3trans.exe finished (0004).

    R3trans=>sapparam(1c): No Profile used.

    R3trans=>sapparam: SAPSYSTEMNAME neither in Profile nor in Commandline

    This is E:\usr\sap\PRD\SUM\abap\exe\R3trans.exe version 6.23 (release 720 - 27.03.12 - 17:30:00).

    unicode enabled version

    E:\usr\sap\PRD\SUM\abap\exe\R3trans.exe finished (0004).

    R3trans=>sapparam(1c): No Profile used.

    R3trans=>sapparam: SAPSYSTEMNAME neither in Profile nor in Commandline

    This is E:\usr\sap\PRD\SUM\abap\exe\R3trans.exe version 6.23 (release 720 - 27.03.12 - 17:30:00).

    unicode enabled version

    E:\usr\sap\PRD\SUM\abap\exe\R3trans.exe finished (0004).

    R3trans=>sapparam(1c): No Profile used.

    R3trans=>sapparam: SAPSYSTEMNAME neither in Profile nor in Commandline

    This is E:\usr\sap\PRD\SUM\abap\exe\R3trans.exe version 6.23 (release 720 - 27.03.12 - 17:30:00).

    unicode enabled version

    E:\usr\sap\PRD\SUM\abap\exe\R3trans.exe finished (0004).

    R3trans=>sapparam(1c): No Profile used.

    R3trans=>sapparam: SAPSYSTEMNAME neither in Profile nor in Commandline

    This is E:\usr\sap\PRD\SUM\abap\exe\R3trans.exe version 6.23 (release 720 - 27.03.12 - 17:30:00).

    unicode enabled version

    E:\usr\sap\PRD\SUM\abap\exe\R3trans.exe finished (0004).

    R3trans=>sapparam(1c): No Profile used.

    R3trans=>sapparam: SAPSYSTEMNAME neither in Profile nor in Commandline

    This is E:\usr\sap\PRD\SUM\abap\exe\R3trans.exe version 6.23 (release 720 - 27.03.12 - 17:30:00).

    unicode enabled version

    E:\usr\sap\PRD\SUM\abap\exe\R3trans.exe finished (0004).

    R3trans=>sapparam(1c): No Profile used.

    R3trans=>sapparam: SAPSYSTEMNAME neither in Profile nor in Commandline

    This is E:\usr\sap\PRD\SUM\abap\exe\R3trans.exe version 6.23 (release 720 - 27.03.12 - 17:30:00).

    unicode enabled version

    E:\usr\sap\PRD\SUM\abap\exe\R3trans.exe finished (0004).

    R3trans=>sapparam(1c): No Profile used.

    R3trans=>sapparam: SAPSYSTEMNAME neither in Profile nor in Commandline

    This is E:\usr\sap\PRD\SUM\abap\exe\R3trans.exe version 6.23 (release 720 - 27.03.12 - 17:30:00).

    unicode enabled version

    E:\usr\sap\PRD\SUM\abap\exe\R3trans.exe finished (0004).

    R3trans=>sapparam(1c): No Profile used.

    R3trans=>sapparam: SAPSYSTEMNAME neither in Profile nor in Commandline

    This is E:\usr\sap\PRD\SUM\abap\exe\R3trans.exe version 6.23 (release 720 - 27.03.12 - 17:30:00).

    unicode enabled version

    E:\usr\sap\PRD\SUM\abap\exe\R3trans.exe finished (0004).

    R3trans=>sapparam(1c): No Profile used.

    R3trans=>sapparam: SAPSYSTEMNAME neither in Profile nor in Commandline

    This is E:\usr\sap\PRD\SUM\abap\exe\R3trans.exe version 6.23 (release 720 - 27.03.12 - 17:30:00).

    unicode enabled version

    E:\usr\sap\PRD\SUM\abap\exe\R3trans.exe finished (0004).

    R3trans=>sapparam(1c): No Profile used.

    R3trans=>sapparam: SAPSYSTEMNAME neither in Profile nor in Commandline

    This is E:\usr\sap\PRD\SUM\abap\exe\R3trans.exe version 6.23 (release 720 - 27.03.12 - 17:30:00).

    unicode enabled version

    E:\usr\sap\PRD\SUM\abap\exe\R3trans.exe finished (0004).

    R3trans=>sapparam(1c): No Profile used.

    R3trans=>sapparam: SAPSYSTEMNAME neither in Profile nor in Commandline

    This is E:\usr\sap\PRD\SUM\abap\exe\R3trans.exe version 6.23 (release 720 - 27.03.12 - 17:30:00).

    unicode enabled version

    E:\usr\sap\PRD\SUM\abap\exe\R3trans.exe finished (0004).

    R3trans=>sapparam(1c): No Profile used.

    R3trans=>sapparam: SAPSYSTEMNAME neither in Profile nor in Commandline

    This is E:\usr\sap\PRD\SUM\abap\exe\R3trans.exe version 6.23 (release 720 - 27.03.12 - 17:30:00).

    unicode enabled version

    E:\usr\sap\PRD\SUM\abap\exe\R3trans.exe finished (0004).

    R3trans=>sapparam(1c): No Profile used.

    R3trans=>sapparam: SAPSYSTEMNAME neither in Profile nor in Commandline

    This is E:\usr\sap\PRD\SUM\abap\exe\R3trans.exe version 6.23 (release 720 - 27.03.12 - 17:30:00).

    unicode enabled version

    E:\usr\sap\PRD\SUM\abap\exe\R3trans.exe finished (0004).

    R3trans=>sapparam(1c): No Profile used.

    R3trans=>sapparam: SAPSYSTEMNAME neither in Profile nor in Commandline

    This is E:\usr\sap\PRD\SUM\abap\exe\R3trans.exe version 6.23 (release 720 - 27.03.12 - 17:30:00).

    unicode enabled version

    E:\usr\sap\PRD\SUM\abap\exe\R3trans.exe finished (0004).

    R3trans=>sapparam(1c): No Profile used.

    R3trans=>sapparam: SAPSYSTEMNAME neither in Profile nor in Commandline

    This is E:\usr\sap\PRD\SUM\abap\exe\R3trans.exe version 6.23 (release 720 - 27.03.12 - 17:30:00).

    unicode enabled version

    E:\usr\sap\PRD\SUM\abap\exe\R3trans.exe finished (0004).

    R3trans=>sapparam(1c): No Profile used.

    R3trans=>sapparam: SAPSYSTEMNAME neither in Profile nor in Commandline

    This is E:\usr\sap\PRD\SUM\abap\exe\R3trans.exe version 6.23 (release 720 - 27.03.12 - 17:30:00).

    unicode enabled version

    E:\usr\sap\PRD\SUM\abap\exe\R3trans.exe finished (0004).

    R3trans=>sapparam(1c): No Profile used.

    R3trans=>sapparam: SAPSYSTEMNAME neither in Profile nor in Commandline

    This is E:\usr\sap\PRD\SUM\abap\exe\R3trans.exe version 6.23 (release 720 - 27.03.12 - 17:30:00).

    unicode enabled version

    E:\usr\sap\PRD\SUM\abap\exe\R3trans.exe finished (0004).

    R3trans=>sapparam(1c): No Profile used.

    R3trans=>sapparam: SAPSYSTEMNAME neither in Profile nor in Commandline

    This is E:\usr\sap\PRD\SUM\abap\exe\R3trans.exe version 6.23 (release 720 - 27.03.12 - 17:30:00).

    unicode enabled version

    E:\usr\sap\PRD\SUM\abap\exe\R3trans.exe finished (0004).

    R3trans=>sapparam(1c): No Profile used.

    R3trans=>sapparam: SAPSYSTEMNAME neither in Profile nor in Commandline

    This is E:\usr\sap\PRD\SUM\abap\exe\R3trans.exe version 6.23 (release 720 - 27.03.12 - 17:30:00).

    unicode enabled version

    E:\usr\sap\PRD\SUM\abap\exe\R3trans.exe finished (0004).

    R3trans=>sapparam(1c): No Profile used.

    R3trans=>sapparam: SAPSYSTEMNAME neither in Profile nor in Commandline

    This is E:\usr\sap\PRD\SUM\abap\exe\R3trans.exe version 6.23 (release 720 - 27.03.12 - 17:30:00).

    unicode enabled version

    E:\usr\sap\PRD\SUM\abap\exe\R3trans.exe finished (0004).

    R3trans=>sapparam(1c): No Profile used.

    R3trans=>sapparam: SAPSYSTEMNAME neither in Profile nor in Commandline

    This is E:\usr\sap\PRD\SUM\abap\exe\R3trans.exe version 6.23 (release 720 - 27.03.12 - 17:30:00).

    unicode enabled version

    E:\usr\sap\PRD\SUM\abap\exe\R3trans.exe finished (0004).

    R3trans=>sapparam(1c): No Profile used.

    R3trans=>sapparam: SAPSYSTEMNAME neither in Profile nor in Commandline

    This is E:\usr\sap\PRD\SUM\abap\exe\R3trans.exe version 6.23 (release 720 - 27.03.12 - 17:30:00).

    unicode enabled version

    E:\usr\sap\PRD\SUM\abap\exe\R3trans.exe finished (0004).

    R3trans=>sapparam(1c): No Profile used.

    R3trans=>sapparam: SAPSYSTEMNAME neither in Profile nor in Commandline

    This is E:\usr\sap\PRD\SUM\abap\exe\R3trans.exe version 6.23 (release 720 - 27.03.12 - 17:30:00).

    unicode enabled version

    E:\usr\sap\PRD\SUM\abap\exe\R3trans.exe finished (0004).

    R3trans=>sapparam(1c): No Profile used.

    R3trans=>sapparam: SAPSYSTEMNAME neither in Profile nor in Commandline

    This is E:\usr\sap\PRD\SUM\abap\exe\R3trans.exe version 6.23 (release 720 - 27.03.12 - 17:30:00).

    unicode enabled version

    E:\usr\sap\PRD\SUM\abap\exe\R3trans.exe finished (0004).

    R3trans=>sapparam(1c): No Profile used.

    R3trans=>sapparam: SAPSYSTEMNAME neither in Profile nor in Commandline

    This is E:\usr\sap\PRD\SUM\abap\exe\R3trans.exe version 6.23 (release 720 - 27.03.12 - 17:30:00).

    unicode enabled version

    E:\usr\sap\PRD\SUM\abap\exe\R3trans.exe finished (0004).

    R3trans=>sapparam(1c): No Profile used.

    R3trans=>sapparam: SAPSYSTEMNAME neither in Profile nor in Commandline

    This is E:\usr\sap\PRD\SUM\abap\exe\R3trans.exe version 6.23 (release 720 - 27.03.12 - 17:30:00).

    unicode enabled version

    E:\usr\sap\PRD\SUM\abap\exe\R3trans.exe finished (0004).

    R3trans=>sapparam(1c): No Profile used.

    R3trans=>sapparam: SAPSYSTEMNAME neither in Profile nor in Commandline

    This is E:\usr\sap\PRD\SUM\abap\exe\R3trans.exe version 6.23 (release 720 - 27.03.12 - 17:30:00).

    unicode enabled version

    E:\usr\sap\PRD\SUM\abap\exe\R3trans.exe finished (0004).

    R3trans=>sapparam(1c): No Profile used.

    R3trans=>sapparam: SAPSYSTEMNAME neither in Profile nor in Commandline

    This is E:\usr\sap\PRD\SUM\abap\exe\R3trans.exe version 6.23 (release 720 - 27.03.12 - 17:30:00).

    unicode enabled version

    E:\usr\sap\PRD\SUM\abap\exe\R3trans.exe finished (0004).

    R3trans=>sapparam(1c): No Profile used.

    R3trans=>sapparam: SAPSYSTEMNAME neither in Profile nor in Commandline

    This is E:\usr\sap\PRD\SUM\abap\exe\R3trans.exe version 6.23 (release 720 - 27.03.12 - 17:30:00).

    unicode enabled version

    E:\usr\sap\PRD\SUM\abap\exe\R3trans.exe finished (0004).

    R3trans=>sapparam(1c): No Profile used.

    R3trans=>sapparam: SAPSYSTEMNAME neither in Profile nor in Commandline

    This is E:\usr\sap\PRD\SUM\abap\exe\R3trans.exe version 6.23 (release 720 - 27.03.12 - 17:30:00).

    unicode enabled version

    E:\usr\sap\PRD\SUM\abap\exe\R3trans.exe finished (0004).

    R3trans=>sapparam(1c): No Profile used.

    R3trans=>sapparam: SAPSYSTEMNAME neither in Profile nor in Commandline

    This is E:\usr\sap\PRD\SUM\abap\exe\R3trans.exe version 6.23 (release 720 - 27.03.12 - 17:30:00).

    unicode enabled version

    E:\usr\sap\PRD\SUM\abap\exe\R3trans.exe finished (0004).

    R3trans=>sapparam(1c): No Profile used.

    R3trans=>sapparam: SAPSYSTEMNAME neither in Profile nor in Commandline

    This is E:\usr\sap\PRD\SUM\abap\exe\R3trans.exe version 6.23 (release 720 - 27.03.12 - 17:30:00).

    unicode enabled version

    E:\usr\sap\PRD\SUM\abap\exe\R3trans.exe finished (0004).

    R3trans=>sapparam(1c): No Profile used.

    R3trans=>sapparam: SAPSYSTEMNAME neither in Profile nor in Commandline

    This is E:\usr\sap\PRD\SUM\abap\exe\R3trans.exe version 6.23 (release 720 - 27.03.12 - 17:30:00).

    unicode enabled version

    E:\usr\sap\PRD\SUM\abap\exe\R3trans.exe finished (0004).

    R3trans=>sapparam(1c): No Profile used.

    R3trans=>sapparam: SAPSYSTEMNAME neither in Profile nor in Commandline

    This is E:\usr\sap\PRD\SUM\abap\exe\R3trans.exe version 6.23 (release 720 - 27.03.12 - 17:30:00).

    unicode enabled version

    E:\usr\sap\PRD\SUM\abap\exe\R3trans.exe finished (0004).

    R3trans=>sapparam(1c): No Profile used.

    R3trans=>sapparam: SAPSYSTEMNAME neither in Profile nor in Commandline

    This is E:\usr\sap\PRD\SUM\abap\exe\R3trans.exe version 6.23 (release 720 - 27.03.12 - 17:30:00).

    unicode enabled version

    E:\usr\sap\PRD\SUM\abap\exe\R3trans.exe finished (0004).

    R3trans=>sapparam(1c): No Profile used.

    R3trans=>sapparam: SAPSYSTEMNAME neither in Profile nor in Commandline

    This is E:\usr\sap\PRD\SUM\abap\exe\R3trans.exe version 6.23 (release 720 - 27.03.12 - 17:30:00).

    unicode enabled version

    E:\usr\sap\PRD\SUM\abap\exe\R3trans.exe finished (0004).

    R3trans=>sapparam(1c): No Profile used.

    R3trans=>sapparam: SAPSYSTEMNAME neither in Profile nor in Commandline

    This is E:\usr\sap\PRD\SUM\abap\exe\R3trans.exe version 6.23 (release 720 - 27.03.12 - 17:30:00).

    unicode enabled version

    E:\usr\sap\PRD\SUM\abap\exe\R3trans.exe finished (0004).

    R3trans=>sapparam(1c): No Profile used.

    R3trans=>sapparam: SAPSYSTEMNAME neither in Profile nor in Commandline

    This is E:\usr\sap\PRD\SUM\abap\exe\R3trans.exe version 6.23 (release 720 - 27.03.12 - 17:30:00).

    unicode enabled version

    E:\usr\sap\PRD\SUM\abap\exe\R3trans.exe finished (0004).

    R3trans=>sapparam(1c): No Profile used.

    R3trans=>sapparam: SAPSYSTEMNAME neither in Profile nor in Commandline

    tp finished with return code: 4

    meaning:

      A tool used by tp produced warnings

    tp=>sapparam(1c): No Profile used.

    tp=>sapparam: SAPSYSTEMNAME neither in Profile nor in Commandline

    SAPup> Process with PID 33396 terminated with status 4 at 20120608024421!

     

    ### Phase MAIN_SHDRUN/DDIC_CUST:

     

    ### Phase MAIN_SHDRUN/SQLDB_DD1217:

     

    ### Phase MAIN_SHDRUN/JOB_RSWBOUP1_SHD:

     

    ### Phase MAIN_SHDRUN/RUN_RSINCGEN_SHD1:

     

    ### Phase MAIN_SHDRUN/JOB_UMOD20_UPG:

     

    ### Phase MAIN_SHDRUN/RUN_RADTBUCACT:

     

    ### Phase MAIN_SHDRUN/DB6_ACTIONS:

     

    ### Phase MAIN_SHDRUN/BUFFEROP_ACTUPG:

     

    ### Phase MAIN_SHDRUN/ACT_UPG:

    SAPup> Starting subprocess at 20120608024708

        ENV: JAVA_HOME=C:\j2sdk1.4.2_17-x64

        ENV: NLS_LANG=AMERICAN_AMERICA.UTF8

        ENV: ORACLE_HOME=F:\oracle\PRD\11202

        ENV: ORACLE_SID=PRD

        ENV: PATHEXT=.COM;.EXE;.BAT;.CMD;.VBS;.VBE;.JS;.JSE;.WSF;.WSH;.MSC

        ENV: SAPDATA_HOME=F:\oracle\PRD

        ENV: SAPSYSTEMNAME=PRD

        ENV: auth_shadow_upgrade=1

        ENV: dbs_ora_schema=SAPSR3

        ENV: dbs_ora_tnsname=PRD

        ENV: PATH=E:\usr\sap\PRD\SUM\abap\exe

     

    EXECUTING E:\usr\sap\PRD\SUM\abap\exe\tp.exe (tp.exe)  pf=E:\usr\sap\PRD\SUM\abap\var\ACTUPG.TPP put PRD

    This is E:\usr\sap\PRD\SUM\abap\exe\tp.exe version 380.03.82 (release 720, unicode enabled)

    Warning: Parameter DAYLIGHT_SHUTDOWN is no longer used.

    Warning: Parameter WITH_TACOB is no longer used.

    Warning: Parameter IMPDP_BY_EVENT is no longer used.

    Warning: Parameter INTERRUPT is no longer used.

    Warning: unknown parameter DYNAMIC_PARAMETERS in parameter file (line 21).

    Warning: Parameter DAYLIGHT_SHUTDOWN is no longer used.

    Warning: Parameter WITH_TACOB is no longer used.

    Warning: Parameter IMPDP_BY_EVENT is no longer used.

    Warning: Parameter INTERRUPT is no longer used.

    Warning: unknown parameter DYNAMIC_PARAMETERS in parameter file (line 21).

    Warning: Parameter DBCONFPATH is no longer used.

    Looking for effective putsteps ... ... ready (looking for putsteps)

    stopping on error 12 during DD ACTIVATION

     

    tp returncode summary:

     

    TOOLS: Highest return code of single steps was: 12

    WARNS: Highest tp internal warning was: 0118

    tp finished with return code: 12

    meaning:

      A tool used by tp aborted

    tp=>sapparam(1c): No Profile used.

    tp=>sapparam: SAPSYSTEMNAME neither in Profile nor in Commandline

    ERROR: stopping on error 12 during DD ACTIVATION

    SAPup> Process with PID 36504 terminated with status 12 at 20120608035648!

     

    ### Phase MAIN_SHDRUN/ACT_UPG:

    SAPup> Starting subprocess at 20120608054240

        ENV: JAVA_HOME=C:\j2sdk1.4.2_17-x64

        ENV: NLS_LANG=AMERICAN_AMERICA.UTF8

        ENV: ORACLE_HOME=F:\oracle\PRD\11202

        ENV: ORACLE_SID=PRD

        ENV: PATHEXT=.COM;.EXE;.BAT;.CMD;.VBS;.VBE;.JS;.JSE;.WSF;.WSH;.MSC

        ENV: SAPDATA_HOME=F:\oracle\PRD

        ENV: SAPSYSTEMNAME=PRD

        ENV: auth_shadow_upgrade=1

        ENV: dbs_ora_schema=SAPSR3

        ENV: dbs_ora_tnsname=PRD

        ENV: PATH=E:\usr\sap\PRD\SUM\abap\exe

     

    EXECUTING E:\usr\sap\PRD\SUM\abap\exe\tp.exe (tp.exe)  pf=E:\usr\sap\PRD\SUM\abap\var\ACTUPG.TPP put PRD

    This is E:\usr\sap\PRD\SUM\abap\exe\tp.exe version 380.03.82 (release 720, unicode enabled)

    Warning: Parameter DAYLIGHT_SHUTDOWN is no longer used.

    Warning: Parameter WITH_TACOB is no longer used.

    Warning: Parameter IMPDP_BY_EVENT is no longer used.

    Warning: Parameter INTERRUPT is no longer used.

    Warning: unknown parameter DYNAMIC_PARAMETERS in parameter file (line 21).

    Warning: Parameter DAYLIGHT_SHUTDOWN is no longer used.

    Warning: Parameter WITH_TACOB is no longer used.

    Warning: Parameter IMPDP_BY_EVENT is no longer used.

    Warning: Parameter INTERRUPT is no longer used.

    Warning: unknown parameter DYNAMIC_PARAMETERS in parameter file (line 21).

    Warning: Parameter DBCONFPATH is no longer used.

    Looking for effective putsteps ... ... ready (looking for putsteps)

    stopping on error 12 during DD ACTIVATION

     

    tp returncode summary:

     

    TOOLS: Highest return code of single steps was: 12

    WARNS: Highest tp internal warning was: 0118

    tp finished with return code: 12

    meaning:

      A tool used by tp aborted

    tp=>sapparam(1c): No Profile used.

    tp=>sapparam: SAPSYSTEMNAME neither in Profile nor in Commandline

    ERROR: stopping on error 12 during DD ACTIVATION

    SAPup> Process with PID 35328 terminated with status 12 at 20120608065020!

     

    ### Phase MAIN_SHDRUN/ACT_UPG:

    SAPup> Starting subprocess at 20120608072842

        ENV: JAVA_HOME=C:\j2sdk1.4.2_17-x64

        ENV: NLS_LANG=AMERICAN_AMERICA.UTF8

        ENV: ORACLE_HOME=F:\oracle\PRD\11202

        ENV: ORACLE_SID=PRD

        ENV: PATHEXT=.COM;.EXE;.BAT;.CMD;.VBS;.VBE;.JS;.JSE;.WSF;.WSH;.MSC

        ENV: SAPDATA_HOME=F:\oracle\PRD

        ENV: SAPSYSTEMNAME=PRD

        ENV: auth_shadow_upgrade=1

        ENV: dbs_ora_schema=SAPSR3

        ENV: dbs_ora_tnsname=PRD

        ENV: PATH=E:\usr\sap\PRD\SUM\abap\exe

     

    EXECUTING E:\usr\sap\PRD\SUM\abap\exe\tp.exe (tp.exe)  pf=E:\usr\sap\PRD\SUM\abap\var\ACTUPG.TPP put PRD

    This is E:\usr\sap\PRD\SUM\abap\exe\tp.exe version 380.03.82 (release 720, unicode enabled)

    Warning: Parameter DAYLIGHT_SHUTDOWN is no longer used.

    Warning: Parameter WITH_TACOB is no longer used.

    Warning: Parameter IMPDP_BY_EVENT is no longer used.

    Warning: Parameter INTERRUPT is no longer used.

    Warning: unknown parameter DYNAMIC_PARAMETERS in parameter file (line 21).

    Warning: Parameter DAYLIGHT_SHUTDOWN is no longer used.

    Warning: Parameter WITH_TACOB is no longer used.

    Warning: Parameter IMPDP_BY_EVENT is no longer used.

    Warning: Parameter INTERRUPT is no longer used.

    Warning: unknown parameter DYNAMIC_PARAMETERS in parameter file (line 21).

    Warning: Parameter DBCONFPATH is no longer used.

    Looking for effective putsteps ... ... ready (looking for putsteps)

    stopping on error 12 during DD ACTIVATION

     

    tp returncode summary:

     

    TOOLS: Highest return code of single steps was: 12

    WARNS: Highest tp internal warning was: 0118

    tp finished with return code: 12

    meaning:

      A tool used by tp aborted

    tp=>sapparam(1c): No Profile used.

    tp=>sapparam: SAPSYSTEMNAME neither in Profile nor in Commandline

    ERROR: stopping on error 12 during DD ACTIVATION

    SAPup> Process with PID 35604 terminated with status 12 at 20120608083622!

     

    ### Phase MAIN_SHDRUN/ACT_UPG:

    SAPup> Starting subprocess at 20120609090130

        ENV: JAVA_HOME=C:\j2sdk1.4.2_17-x64

        ENV: NLS_LANG=AMERICAN_AMERICA.UTF8

        ENV: ORACLE_HOME=F:\oracle\PRD\11202

        ENV: ORACLE_SID=PRD

        ENV: PATHEXT=.COM;.EXE;.BAT;.CMD;.VBS;.VBE;.JS;.JSE;.WSF;.WSH;.MSC

        ENV: SAPDATA_HOME=F:\oracle\PRD

        ENV: SAPSYSTEMNAME=PRD

        ENV: auth_shadow_upgrade=1

        ENV: dbs_ora_schema=SAPSR3

        ENV: dbs_ora_tnsname=PRD

        ENV: PATH=E:\usr\sap\PRD\SUM\abap\exe

     

    EXECUTING E:\usr\sap\PRD\SUM\abap\exe\tp.exe (tp.exe)  pf=E:\usr\sap\PRD\SUM\abap\var\ACTUPG.TPP put PRD

    This is E:\usr\sap\PRD\SUM\abap\exe\tp.exe version 380.03.82 (release 720, unicode enabled)

    Warning: Parameter DAYLIGHT_SHUTDOWN is no longer used.

    Warning: Parameter WITH_TACOB is no longer used.

    Warning: Parameter IMPDP_BY_EVENT is no longer used.

    Warning: Parameter INTERRUPT is no longer used.

    Warning: unknown parameter DYNAMIC_PARAMETERS in parameter file (line 21).

    Warning: Parameter DAYLIGHT_SHUTDOWN is no longer used.

    Warning: Parameter WITH_TACOB is no longer used.

    Warning: Parameter IMPDP_BY_EVENT is no longer used.

    Warning: Parameter INTERRUPT is no longer used.

    Warning: unknown parameter DYNAMIC_PARAMETERS in parameter file (line 21).

    Warning: Parameter DBCONFPATH is no longer used.

    Looking for effective putsteps ... ... ready (looking for putsteps)

    stopping on error 12 during DD ACTIVATION

     

    tp returncode summary:

     

    TOOLS: Highest return code of single steps was: 12

    WARNS: Highest tp internal warning was: 0118

    tp finished with return code: 12

    meaning:

      A tool used by tp aborted

    tp=>sapparam(1c): No Profile used.

    tp=>sapparam: SAPSYSTEMNAME neither in Profile nor in Commandline

    ERROR: stopping on error 12 during DD ACTIVATION

    SAPup> Process with PID 35616 terminated with status 12 at 20120609100910!

     

    ### Phase MAIN_SHDRUN/ACT_UPG:

    SAPup> Starting subprocess at 20120609120240

        ENV: JAVA_HOME=C:\j2sdk1.4.2_17-x64

        ENV: NLS_LANG=AMERICAN_AMERICA.UTF8

        ENV: ORACLE_HOME=F:\oracle\PRD\11202

        ENV: ORACLE_SID=PRD

        ENV: PATHEXT=.COM;.EXE;.BAT;.CMD;.VBS;.VBE;.JS;.JSE;.WSF;.WSH;.MSC

        ENV: SAPDATA_HOME=F:\oracle\PRD

        ENV: SAPSYSTEMNAME=PRD

        ENV: auth_shadow_upgrade=1

        ENV: dbs_ora_schema=SAPSR3

        ENV: dbs_ora_tnsname=PRD

        ENV: PATH=E:\usr\sap\PRD\SUM\abap\exe

     

    EXECUTING E:\usr\sap\PRD\SUM\abap\exe\tp.exe (tp.exe)  pf=E:\usr\sap\PRD\SUM\abap\var\ACTUPG.TPP put PRD

    This is E:\usr\sap\PRD\SUM\abap\exe\tp.exe version 380.03.58 (release 720, unicode enabled)

    Warning: Parameter DAYLIGHT_SHUTDOWN is no longer used.

    Warning: Parameter WITH_TACOB is no longer used.

    Warning: Parameter IMPDP_BY_EVENT is no longer used.

    Warning: Parameter INTERRUPT is no longer used.

    Warning: unknown parameter DYNAMIC_PARAMETERS in parameter file (line 21).

    Warning: Parameter DAYLIGHT_SHUTDOWN is no longer used.

    Warning: Parameter WITH_TACOB is no longer used.

    Warning: Parameter IMPDP_BY_EVENT is no longer used.

    Warning: Parameter INTERRUPT is no longer used.

    Warning: unknown parameter DYNAMIC_PARAMETERS in parameter file (line 21).

    Warning: Parameter DBCONFPATH is no longer used.

    Looking for effective putsteps ... ... ready (looking for putsteps)

    stopping on error 12 during DD ACTIVATION

     

    tp returncode summary:

     

    TOOLS: Highest return code of single steps was: 12

    WARNS: Highest tp internal warning was: 0118

    tp finished with return code: 12

    meaning:

      A tool used by tp aborted

    tp=>sapparam(1c): No Profile used.

    tp=>sapparam: SAPSYSTEMNAME neither in Profile nor in Commandline

    ERROR: stopping on error 12 during DD ACTIVATION

    SAPup> Process with PID 36224 terminated with status 12 at 20120609131020!

     

    ### Phase MAIN_SHDRUN/ACT_UPG:

    SAPup> Starting subprocess at 20120610024652

        ENV: JAVA_HOME=C:\j2sdk1.4.2_17-x64

        ENV: NLS_LANG=AMERICAN_AMERICA.UTF8

        ENV: ORACLE_HOME=F:\oracle\PRD\11202

        ENV: ORACLE_SID=PRD

        ENV: PATHEXT=.COM;.EXE;.BAT;.CMD;.VBS;.VBE;.JS;.JSE;.WSF;.WSH;.MSC

        ENV: SAPDATA_HOME=F:\oracle\PRD

        ENV: SAPSYSTEMNAME=PRD

        ENV: auth_shadow_upgrade=1

        ENV: dbs_ora_schema=SAPSR3

        ENV: dbs_ora_tnsname=PRD

        ENV: PATH=E:\usr\sap\PRD\SUM\abap\exe

     

    EXECUTING E:\usr\sap\PRD\SUM\abap\exe\tp.exe (tp.exe)  pf=E:\usr\sap\PRD\SUM\abap\var\ACTUPG.TPP put PRD

    This is E:\usr\sap\PRD\SUM\abap\exe\tp.exe version 380.03.58 (release 720, unicode enabled)

    Warning: Parameter DAYLIGHT_SHUTDOWN is no longer used.

    Warning: Parameter WITH_TACOB is no longer used.

    Warning: Parameter IMPDP_BY_EVENT is no longer used.

    Warning: Parameter INTERRUPT is no longer used.

    Warning: unknown parameter DYNAMIC_PARAMETERS in parameter file (line 21).

    Warning: Parameter DAYLIGHT_SHUTDOWN is no longer used.

    Warning: Parameter WITH_TACOB is no longer used.

    Warning: Parameter IMPDP_BY_EVENT is no longer used.

    Warning: Parameter INTERRUPT is no longer used.

    Warning: unknown parameter DYNAMIC_PARAMETERS in parameter file (line 21).

    Warning: Parameter DBCONFPATH is no longer used.

    Looking for effective putsteps ... ... ready (looking for putsteps)

    stopping on error 12 during DD ACTIVATION

     

    tp returncode summary:

     

    TOOLS: Highest return code of single steps was: 12

    WARNS: Highest tp internal warning was: 0118

    tp finished with return code: 12

    meaning:

      A tool used by tp aborted

    tp=>sapparam(1c): No Profile used.

    tp=>sapparam: SAPSYSTEMNAME neither in Profile nor in Commandline

    ERROR: stopping on error 12 during DD ACTIVATION

    SAPup> Process with PID 31520 terminated with status 12 at 20120610035502!


    0 0

    Hello,

    We are using CCMS to monitor our Database backup Status everyday.

    But recently I have found that CCMS does not show the correct results for the Last Successful Backup Node.

     

    SAP CCMS Monitor Templates --> Database --> DB2 Universal Database for NT/UNIX --> Backup/restore -->database backup --> last successful backup

     

    This last successful backup always shows the message that "The last Database backup is current"

     

    But when I checked the backup status using DBACOCKPIT or DB12 transaction, the last backup was failed.

     

    Please let us know how to solve this standard sap CCMs bug?

     

    Regards,

    Eswaran


    0 0

    Hi, experts,

     

    I make import with compress option. But SWPM make compress only for tables.

    Q:

    1. Can I edit *.SQL (DODS, ..) for exchange "nocompress" to "compress n"?

    2. Clone DDLORA.TPL with manual insert "compress n" for large indexes? What's proper syntax?

     

    Regards,

    Vlad


    0 0

    Hello.

     

    We are trying to delete entries from table DBTABLOG on background job,

    but report RSTBPDEL cannot run on background job.(Note1143154)

     

    Someone knows the report which can delete entries from table DBTABLOG

    on background job?

     

    Regards,

    Kazuaki Anzai


    0 0
  • 04/15/16--02:23: SDM Error
  • Hi,

     

    after we split our ERP System ABAP and JAVA and update the system to EHP7 we try the first System Copy.

     

    We receive the following error with the system copy or while starting and stopping the SDM.

     

    For example.

     

    ./StopServer.sh

     

    Starting '/usr/sap/***/***/exe/sapjvm_4/bin/java' '-Xmx512M' -jar '/usr/sap/***/***/SDM/program/bin/SDM.jar' shutdown 'sdmguiport=50***' 'sdmhome=/usr/sap/***/***/SDM/program' Starting SDM - Software Deployment Manager...

    tc/SL/SDM/SDM/sap.com/SAP AG/7.0213.20120926150800.0000

    Caught Exception: java.lang.IllegalStateException

    java.lang.IllegalStateException: Cannot access SecureStore.

    Additional error message is:

    com.sap.security.core.server.secstorefs.FileInvalidException: File "/usr/sap/***/SYS/global/security/data/SecStore.properties" is invalid: software version 6.30.000.001 is incompatible with file version 7.00.000.001.       

    at com.sap.sdm.is.secstore.extern.SecureStoreAccessImpl.openExistingStore(SecureStoreAccessImpl.java:54)       

    at com.sap.sdm.is.secstore.AbstractSecureStoreAccess.getStringValue(AbstractSecureStoreAccess.java:46)       

    at com.sap.sdm.control.command.cmds.ShutdownServer.getPasswordFromSecStore(ShutdownServer.java:278)       

    at com.sap.sdm.control.command.cmds.ShutdownServer.execute(ShutdownServer.java:71)       

    at com.sap.sdm.control.command.decorator.SDMInitializer.execute(SDMInitializer.java:52)       

    at com.sap.sdm.control.command.decorator.GlobalParamEvaluator.execute(GlobalParamEvaluator.java:60)       

    at com.sap.sdm.control.command.decorator.AbstractLibDirSetter.execute(AbstractLibDirSetter.java:46)       

    at com.sap.sdm.control.command.decorator.ExitPostProcessor.execute(ExitPostProcessor.java:48)       

    at com.sap.sdm.control.command.decorator.ClientComponentInitializer.execute(ClientComponentInitializer.java:25)       

    at com.sap.sdm.control.command.decorator.SyntaxChecker.execute(SyntaxChecker.java:37)       

    at com.sap.sdm.control.command.Command.exec(Command.java:42)       

    at SDM.main(SDM.java:21)

    Severe (internal) error. Return code: 16

     

    Note 1795971 does not help.

     

    Unfortunately I could not find a solution, every tip I would be very grateful.

     

    Best regards

     

    Georg


    0 0

    Hi all,

    my external consultant company has confirmed me that in Italy is not possible SAP archive procedure if there are not data at least stored for 5 years.

    Someone could confirm me that?

    Best regards.


    0 0
  • 04/19/16--00:34: NW750 silent install error
  • Hi,

     

    I try to install NW750 under silent mode but failed, please find error log below.

     

    INFO       2016-04-19 06:49:46.855 (root/sapinst) [syuxccuren.cpp:543] id=syslib.process.currentProcessEnv.cwdSuccessful CSyCurrentProcessEnvironmentImpl::setWorkingDirectory(const CSyPath& /hadr/install/inst)

    Working directory changed to /hadr/install/inst.

     

     

    TRACE      2016-04-19 06:49:46.855 (root/sapinst) [syuxccuren.cpp:111] CSyCurrentProcessEnvironmentImpl::setUmask(ulong)

    umask set to 23

     

     

    INFO       2016-04-19 06:49:46.864 (root/sapinst) [CSiStepExecute.cpp:1053] id=controller.executeStep

    Execute step prepareServicesTable of component |NW_ABAP_OneHost|ind|ind|ind|ind|0|0|NW_Onehost_System|ind|ind|ind|ind|onehost|0|PrerequisiteCheckerDialogs|ind|ind|ind|ind|prc|0

     

     

    TRACE      2016-04-19 06:49:46.979 (root/sapinst) [CSiStepExecute.cpp:1109]

    Execution of preprocess block of |NW_ABAP_OneHost|ind|ind|ind|ind|0|0|NW_Onehost_System|ind|ind|ind|ind|onehost|0|PrerequisiteCheckerDialogs|ind|ind|ind|ind|prc|0|prepareServicesTable returns TRUE

     

     

    TRACE      2016-04-19 06:49:47.183 (root/sapinst) [TableCpp.cpp:138] TableCpp::updateRow()

    Table(tPRCServices).updateRow({

      displayName:Database Instance (AS ABAP)

      id:abap_db_inst

    }, WHERE id = 'abap_db_inst')

    updating

     

     

    ERROR      2016-04-19 06:49:47.184 (root/sapinst) [kdxxctable.cpp:640] id=keydb.tooManyRowsReturned errno=FKD-00033

    Query returned more than one result. Using client |NW_ABAP_OneHost|ind|ind|ind|ind|0|0|NW_Onehost_System|ind|ind|ind|ind|onehost|0, table tPRCServices, where clause WHERE id = 'abap_db_inst'.

     

    From above error message, I searched the inifile.xml and found there are two inifile.xml, one is what I provide which is named to inifile.1.xml and another is new generated inifile.xml, in the generated inifile.xml, I found two same row for abap_db_inst showed below, I compared with the inifile.xml I provide and found there is only one row in that, I wonder why sapinst created two row for abap_db_inst, can any one help me? I made big effort on google but found little useful answer, thanks in advance!

     

      <table name="ParameterTable-NW_ABAP_OneHost-ind-ind-ind-ind-0-0-NW_Onehost_System-ind-ind-ind-ind-onehost-0_tPRCServices" namespaces="INIFILE_PARAMETER">

        <columns>

          <column name="displayName">

            <defaultproperties>

              <property name="TABLE_DOC_SHORT_LONG" value="

    "/>

            </defaultproperties>

          </column>

          <column name="id">

          </column>

          <column name="selected">

          </column>

        </columns>

      <row>

          <fld name="displayName">

            <properties>

              <property name ="TABLE_DOC_SHORT_LONG" value ="

    " />

            </properties>

            <strval><![CDATA[Database Instance (AS ABAP)]]>

            </strval>

          </fld>

          <fld name="id">

            <strval><![CDATA[abap_db_inst]]>

            </strval>

          </fld>

          <fld name="selected">

            <strval><![CDATA[true]]>

            </strval>

          </fld>

        </row>

        <row>

    ....

     

    Best Regards,

    Tony Gao


    0 0

    Hi All,

     

    II work on BI 7.0

     

    I have installed from BI Content the template 0BROADCASTING_TEMPLATE70

     

    But in fact this template is in version 3.X

     

    How can I obtain the version 7 ?

     

    Migration ?

     

    Use another template name in version 7 which do the same thing ?

     

    Thanks for your answer

     

    Regards

     

    Sebastien


    0 0
  • 03/31/16--12:35: Shared Object memory problem
  • Dear Experts,

     

    I am facing an issue regarding of shared object memory problem.What is the parameters need to set for this issue can you guide me please.Now in our company Abapers and webdynpro people are facing this issue.

     

    Inline image 1


    0 0

    Hi,

     

    Would like to know to start the SAP WebDispatcher is it have 2 method?

    1) startsap

    2) sapwebdisp pf=<profile>

     

    Problem now is, earlier I'm using startsap and stopsap to start WD instance. It working fine, but then I run sapwebdisp command. I kill the sapwebdisp process, but now I can't use startsap. Whenever I run the command it will like normal start the instance and said it started. But when I check, it is not started.

     

    Now I'm using sapwebdisp to start the instance. But I need to use the startsap method.

    Would like to know is it because there are 2 method of starting the instance, and is because I use command sapwebdisp therefore it switch the starting mode?

     

    Or any reason in behind and how can I fix it.

    Thanks.


older | 1 | .... | 70 | 71 | (Page 72) | 73 | 74 | .... | 76 | newer